{"text_format":"1","workbook":"xlsx","n_sheets":17,"sheets":["Specifications","Hinweise zum Programm","Dimensioning","Funktion","Maße","Data sheet metric","Data sheet","Grunddaten","Lw","DR","xkr._vx","Einheiten","DAL359-CAP","DAL358-CAP","DRS-CAP","DIA-CAP","MSA-CAP"],"not_rendered":{"charts":0,"images":17,"macros":1,"external_links":1,"defined_names":2,"comments":4,"pivot_tables":0},"unopened":[],"bounds":{"document_bytes":16777216,"sheet_cells":100000,"rows_first":2000,"rows_last":500,"rows_between":2000,"halvings":0,"cell_chars":16384,"cell_head_chars":4096},"cells_cut":0,"cells_raw":0,"read":"whole","date_system":"1900"}

{"sheet":"Specifications","index":0,"n_rows":99,"n_cols":11,"rows_kept":99,"cut":false,"hidden":false,"merged":[[96,4,96,5],[97,4,97,5],[98,4,98,5],[0,0,0,3],[5,0,5,3],[53,1,53,3],[54,1,54,3],[58,1,58,3],[59,1,59,3],[12,0,12,3],[67,1,67,3],[71,1,71,3],[62,1,62,3],[64,1,64,3],[20,0,20,3],[95,4,95,5],[48,0,48,3],[78,0,88,2],[92,4,92,5],[93,4,93,5],[94,4,94,5],[49,1,49,3]]}
["Calculation-tool emcoair swirl diffusers"]
[]
["Input boxes are yellow"]
["Output boxes are blue (not changeable)"]
[]
["Specifications"]
["Air-handling and acoustics","Symbol","Unit","Value"]
["Total air-volume flow","V·SUP","m³/h",350]
["Number of diffusers (supply only)","n",1,1]
["supply-air temperature ","tSUP","°C",21]
["room temperature","tRoom","°C",20]
["Maximum sound-power level per diffuser","LW,Amax","dB(A)",36]
["Room specifications"]
["Height of the room","H1","m",3]
["Upper limit, habitation area","H2","m",1.8]
["Length of the room","LR","m",10]
["Width of the room","BR","m",10]
["Abstand Durchlass zur nächstgelegenen Wand","a","m",3]
["kleinster Abstand zwischen 2 Durchlässen","smin","m",5]
[]
["Akustikdaten"]
["Raumart nach VDI 2081",null,null,"Großraumbüro"]
[null,null,"Einzelbüro",null,null,null,null,5,"min. Abmessung Frontblende rund",{"$f":"Grunddaten!S33","v":500},"mm"]
[null,null,"Großraumbüro"]
[null,null,"Werkstätten"]
[null,null,"Ruheraum, Pausenraum"]
[null,null,"Untersuchungsraum Krankenhaus"]
[null,null,"Rundfunk-, Fernsehstudio"]
[null,null,"Chemielabor"]
[null,null,"Wasch- und WC-Raum, Umkleide"]
[null,null,"Schwimmbad"]
[null,null,"EDV-Raum"]
[null,null,"Konzertsaal"]
[null,null,"Lesesaal"]
[null,null,"Museum"]
[null,null,"Küche"]
[null,null,"Theater, Kino"]
[null,null,"Klassen- Seminarraum"]
[null,null,"Gaststätte"]
[null,null,"kein Typ"]
[null,null,"Konferenzraum"]
[null,null,"Hotelzimmer"]
[null,null,"Hörsaal"]
[null,null,"Bettenzimmer Krankenhaus"]
[null,null,"Verkaufsraum"]
[null,"","Sporthalle"]
["Maximaler Schallleistungspegel",null,null,"Zuluft"]
["Abstand zur Schallquelle","r","m",3]
["Zusatzdaten"]
["Funktion","",null,null,{"$f":"VLOOKUP(B50,Einheiten!$A$50:$B$53,2,FALSE)","v":{"$error":"#N/A"}},{"$f":"VLOOKUP($B$50,$B$51:$F$53,6,0)","v":{"$error":"#N/A"}}]
[null,{"$f":"IF(#REF!=500,\"Zuluft\",\"\")","v":{"$error":"#REF!"}},null,null,null,"Z"]
[null,{"$f":"IF(#REF!=500,\"Abluft\",\"\")","v":{"$error":"#REF!"}},null,null,null,"A"]
[null,{"$f":"IF(#REF!>500,\"Zuluft/Abluft-Kombination\",\"\")","v":{"$error":"#REF!"}},null,null,null,"K"]
["Farbe Abdeckprofil und Endwinkel",9010,null,null,{"$f":"VLOOKUP(B54,Einheiten!A50:B53,2,FALSE)","v":{"$error":"#N/A"}},{"$f":"$B$54","v":9010}]
["Farbe Luftlenkelement","schwarz",null,null,null,{"$f":"VLOOKUP(B55,B56:F58,6,FALSE)","v":{"$error":"#REF!"}}]
[null,"schwarz",null,null,null,"S"]
[null,"weiß",null,null,null,"W"]
[null,"grau",null,null,null,"G"]
["Einstellung Luftlenkelement",null,null,null,null,{"$f":"VLOOKUP(B59,B60:F63,6,FALSE)","v":{"$error":"#N/A"}}]
[null,"Deckenstrahl D / E",null,null,null,"D"]
[null,"Sondereinstellung",null,null,null,"S"]
[]
["Werkstoff Anschlusskasten","Stahl verzinkt",null,null,null,"V"]
[null,"Stahl verzinkt"]
["frontseitig bedienbare Drossel","ohne",null,null,{"$f":"VLOOKUP(B65,Einheiten!$A$50:$B$56,2,FALSE)","v":{"$error":"#N/A"}},{"$f":"VLOOKUP(B65,B66:F68,6,FALSE)","v":{"$error":"#REF!"}}]
[null,"mit",null,null,null,1]
[null,"ohne",null,null,null,0]
["Innenauskleidung","Baustoffklasse B1 (Standard)",null,null,null,{"$f":"VLOOKUP(B68,B69:F72,6,FALSE)","v":{"$error":"#REF!"}}]
[null,"Baustoffklasse B1 (Standard)",null,null,null,"B1"]
[null,"Baustoffklasse A2 (optional)",null,null,null,"A2"]
[]
["Merkmalschlüssel",{"$f":"CONCATENATE(1,\"KSW\",\"0\",#REF!,F72,F50,\"A\",F54,F55,F59,F63,F65,F68,1,F73)","v":{"$error":"#REF!"}},null,null,null,{"$f":"IF(#REF!<1000,CONCATENATE(0,#REF!),#REF!)","v":{"$error":"#REF!"}}]
["Information on the specifications",null,null,null,null,{"$f":"IF(J18=78,\"080\",100)","v":100}]
["Volume of the room","VR","m³",{"$f":"$D$14*$D$16*$D$17","v":300}]
["Ventilation number","W","1/h",{"$f":"$D$8*60/$D$74","v":70}]
["Sensitive cooling capacity","Q°K","W",{"$f":"Einheiten!$D$33","v":-117.36666666666666}]
[]
[]
["Applicable diffusers, please choose!",null,null,{"$f":"Grunddaten!AE4","v":"DAL 359 DN 400"}]
[null,null,null,{"$f":"Grunddaten!AE5","v":"DAL 359 DN 500"}]
[null,null,null,{"$f":"Grunddaten!AE6","v":"DAL 358 DN 500"}]
[null,null,null,{"$f":"Grunddaten!AE7","v":"DAL 358 DN 600"}]
[null,null,null,{"$f":"Grunddaten!AE8","v":"DRS DN 250"}]
[null,null,null,{"$f":"Grunddaten!AE9","v":"DRS DN 315"}]
[null,null,null,{"$f":"Grunddaten!AE10","v":"DRS DN 355"}]
[null,null,null,{"$f":"Grunddaten!AE11","v":"MSA DN 500"}]
[null,null,null,{"$f":"Grunddaten!AE12","v":"MSA DN 600"}]
[null,null,null,{"$f":"Grunddaten!AE13","v":""}]
[null,null,null,{"$f":"Grunddaten!AE14","v":""}]
[null,null,null,{"$f":"Grunddaten!AE15","v":""}]
["Subject to modifications",null,null,{"$f":"Grunddaten!AE16","v":""}]
["Date:",{"$f":"Grunddaten!E36","v":"2017-05-31"},null,{"$f":"Grunddaten!AE17","v":""}]
[{"$f":"Grunddaten!E36","v":"2017-05-31"},null,null,{"$f":"Grunddaten!AE18","v":""},{"$f":"Grunddaten!AG18","v":0}]
[null,null,null,{"$f":"Grunddaten!AE19","v":""},{"$f":"Grunddaten!AG19","v":0}]
[null,null,null,null,{"$f":"Grunddaten!AG20","v":0}]
[null,null,null,null,{"$f":"Grunddaten!AG21","v":0}]
[null,null,null,null,{"$f":"Grunddaten!AG22","v":0}]
[null,null,null,null,{"$f":"Grunddaten!AG23","v":0}]
[null,null,null,null,{"$f":"Grunddaten!AG24","v":0}]

{"sheet":"Hinweise zum Programm","index":1,"n_rows":22,"n_cols":1,"rows_kept":22,"cut":false,"hidden":true,"merged":[]}
["Hinweise zur Bedienung"]
[]
["Allgemeine Hinweise:"]
["Das Auslegungstool Draller dient als Hilfsmittel zur Technischen Planung des emcoair KSW. "]
[]
["Auslegung:"]
["Im Tabellenblatt \"Auslegung\" erfolgt die Festlegung des gewünschten Auslasstyps. Bei Eingabe der Vorgabedaten, wie z.B. dem benötigten Luftvolumenstrom werden die technischen Daten des gewählten Luftdurchlasses berechnet."]
[]
["Strömungsformen:"]
["Die im Tabellenblatt \"Auslegung\" ermittelten Strömungsgeschwindigkeiten gelten für einen deckenbündig montierten Luftdurchlass mit horizontaler Ausblascharakteristik. "]
[]
["Funktion:"]
["Im Tabellenblatt \"Funktion\" finden Sie eine kurze Funktionsbeschreibung zum emcoair KSW."]
[]
["Maße:"]
["Das Tabellenblatt \"Maße\" gibt einen Überblick über die wählbare Größen und Varianten des emcoair KSW mit detaillierten Bemaßungen."]
[]
["Hinweise zur Funktion:"]
["Für eine ordnungsgemäße Funktion des Auslegungstools muss die Ausführung von Makros und MS Excel aktiviert sein. Die Aktivierung von Makros erfolgt im Menü Makrosicherheit."]
["Einstellung unter MS Excel 97-2003: Extras → Makro → Sicherheit"]
["Einstellung unter MS Excel 2007: Entwicklertools* → Makrosicherheit  "]
["*Das Menü Entwicklertools muss unter Umständen eingefügt werden unter Excel-Optionen"]

{"sheet":"Dimensioning","index":2,"n_rows":137,"n_cols":12,"rows_kept":137,"cut":false,"hidden":false,"merged":[[36,3,36,4],[115,3,115,4],[43,0,43,4],[114,3,114,4],[100,4,110,4],[39,3,39,4],[69,3,69,4],[72,3,72,4],[79,1,79,4],[78,1,78,4],[40,3,40,4],[96,1,96,4],[92,1,92,4],[89,1,89,4],[87,1,87,4],[84,1,84,4],[37,3,37,4],[38,3,38,4],[119,3,119,4],[0,0,0,3],[35,0,35,4],[44,3,44,4],[7,3,7,4],[5,0,5,4],[11,3,11,4],[17,3,17,4],[31,3,31,4],[33,3,33,4],[6,3,6,4],[34,3,34,4],[24,3,24,4],[41,3,41,4],[123,3,123,4],[120,3,120,4],[121,3,121,4],[122,3,122,4],[73,0,73,4],[74,1,74,4],[83,1,83,4]]}
["Calculation-tool emcoair swirl diffusers"]
[]
["Input boxes are coloures yellow"]
["Output boxes are coloures blue"]
[]
["Specifications"]
["Air-handling and acoustics","Symbol","Unit","Value"]
["Bezeichung","Symbol","Einheit"]
[null,"L","mm"]
[null,"L","mm"]
[null,"L","mm"]
["Choosen diffuser-type",null,null,"DAL 358"]
[null,null,null,"D359"]
[null,null,null,"D358"]
[null,null,null,"K0D"]
[null,null,null,"K0M"]
[null,null,null,"DIA"]
["Nominal dimension, front panel","DN","[-]",500]
[null,null,null,300]
[null,null,null,400]
[null,null,null,500]
[null,null,null,600]
[null,null,null,625]
[null,null,null,800]
["Hole pattern / nominal diameter","DN","[-]",500]
[null,null,null,{"$f":"IF(AND(OR($D$12=\"K0D\",$D$12=\"DIA\"),OR($D$18=300,$D$18=400,$D$18=500,$D$18=600,$D$18=625,$D$18=800)),100,IF(OR($D$12=\"D359\",$D$12=\"D358\",$D$12=\"K0M\"),300,\"\"))","v":""}]
[null,null,null,{"$f":"IF(AND(OR($D$12=\"K0D\",$D$12=\"DIA\"),OR($D$18=300,$D$18=400,$D$18=500,$D$18=600,$D$18=625,$D$18=800)),125,IF(AND(OR($D$12=\"D359\",$D$12=\"D358\",$D$12=\"K0M\"),OR($D$18=400,$D$18=500,$D$18=600,$D$18=625,$D$18=800)),400,\"\"))","v":""}]
[null,null,null,{"$f":"IF(AND(OR($D$12=\"K0D\",$D$12=\"DIA\"),OR($D$18=300,$D$18=400,$D$18=500,$D$18=600,$D$18=625,$D$18=800)),180,IF(AND(OR($D$12=\"D359\",$D$12=\"D358\",$D$12=\"K0M\"),OR($D$18=500,$D$18=600,$D$18=625,$D$18=800)),500,\"\"))","v":""}]
[null,null,null,{"$f":"IF(AND(OR($D$12=\"K0D\",$D$12=\"DIA\"),OR($D$18=400,$D$18=500,$D$18=600,$D$18=625,$D$18=800)),250,IF(AND(OR($D$12=\"D359\",$D$12=\"D358\",$D$12=\"K0M\"),OR($D$18=600,$D$18=625,$D$18=800)),600,\"\"))","v":""}]
[null,null,null,{"$f":"IF(AND(OR($D$12=\"K0D\",$D$12=\"DIA\"),OR($D$18=500,$D$18=600,$D$18=625,$D$18=800)),315,IF(AND(OR($D$12=\"D359\",$D$12=\"D358\"),$D$18=800),800,\"\"))","v":""}]
[null,null,null,{"$f":"IF(AND(OR($D$12=\"K0D\",$D$12=\"DIA\"),OR($D$18=600,$D$18=625,$D$18=800)),355,IF(AND(OR($D$12=\"D359\",$D$12=\"D358\",$D$12=\"K0M\"),$D$18=800),\"\",\"\"))","v":""}]
["Air-volume flow per diffuser","V·SUP","m³/h",{"$f":"Specifications!$D$8/Specifications!$D$9","v":350}]
["max. Luftgeschwindigkeit im Aufenthaltsbereich","vMax","m/s",0.2]
["Supply-air temperature","tSUP","°C",{"$f":"Specifications!D10","v":21}]
["Room temperature","tRoom","°C",{"$f":"Specifications!$D$11","v":20}]
["Room specifications"]
["Height of the room","H1","m",{"$f":"Specifications!$D$14","v":3}]
["Upper limit, habitation area","H2","m",{"$f":"Specifications!$D$15","v":1.8}]
["Length of the room","LR","m",{"$f":"Specifications!$D$16","v":10},null,null,null,null,1,"Width, plenum box",{"$f":"Grunddaten!Q33","v":492},"mm"]
["Width of the room","BR","m",{"$f":"Specifications!$D$17","v":10},null,null,null,null,2,"Height, plenum box",{"$f":"Grunddaten!P33","v":340},"mm"]
["Distance between diffuser and the next wall","a","m",2,null,null,null,null,3,"Branch diameter",{"$f":"Grunddaten!L33","v":225},"mm"]
["Minimum distance between 2 diffusers","smin","m",2,null,null,null,null,4,"min. quadr. front panel dimensions",{"$f":"Grunddaten!R33","v":498},"mm"]
[null,null,null,null,null,null,null,null,5,"min. round front panel dimensions",{"$f":"Grunddaten!S33","v":500},"mm"]
["Acoustical specifications",null,null,null,null,null,null,null,6,"Minimum air-volume flow",{"$f":"Grunddaten!H33","v":200},"m³/h"]
["Room-type according to VDI 2081",null,null,"single office room",null,null,null,null,7,"Maximum air-volume flow",{"$f":"Grunddaten!I33","v":800},"m³/h"]
[null,null,"single office room",null,null,null,null,null,5,"min. Abmessung Frontblende rund",{"$f":"Grunddaten!S33","v":500},"mm"]
[null,null,"open space office"]
[null,null,"Workshops"]
[null,null,"Chemical-Laboratory"]
[null,null,"Concert halls."]
[null,null,"Theaters. Cinemas."]
[null,null,"Conference rooms"]
[null,null,"Hotel rooms"]
[null,null,"Break rooms"]
[null,null,"Washroom , Toilets "]
[null,null,"Lecture halls"]
[null,null,"Classrooms / seminar rooms"]
[null,null,"Auditorium"]
[null,null,"Patient rooms"]
[null,null,"Operating theatre (room)"]
[null,null,"Swimming pools"]
[null,null,"Museum"]
[null,null,"Restaurants"]
[null,null,"Showrooms"]
[null,null,"Gymnasiums"]
[null,null,"Radio and TV Studios"]
[null,null,"Computer rooms"]
[null,null,"Kitchen"]
[null,"","no type"]
["Considered diffuser",null,null,"Supply"]
[null,null,null,"Supply"]
[null,null,null,"Extract"]
["Distance to sound source","r","m",3]
["Zusatzdaten"]
["Funktion","",null,null,null,{"$f":"VLOOKUP(B75,Einheiten!$A$50:$B$53,2,FALSE)","v":{"$error":"#N/A"}},{"$f":"VLOOKUP($B$75,$B$76:$G$78,6,0)","v":"Z"}]
[null,{"$f":"IF(D12=500,\"Zuluft\",\"\")","v":""},null,null,null,null,"Z"]
[null,{"$f":"IF(D12=500,\"Abluft\",\"\")","v":""},null,null,null,null,"A"]
[null,{"$f":"IF(D12>500,\"Zuluft/Abluft-Kombination\",\"\")","v":"Zuluft/Abluft-Kombination"},null,null,null,null,"K"]
["Farbe Abdeckprofil und Endwinkel",9010,null,null,null,{"$f":"VLOOKUP(B79,Einheiten!A50:B53,2,FALSE)","v":{"$error":"#N/A"}},{"$f":"$B$79","v":9010}]
["Farbe Luftlenkelement","schwarz",null,null,null,null,{"$f":"VLOOKUP(B80,B81:G83,6,FALSE)","v":"S"}]
[null,"schwarz",null,null,null,null,"S"]
[null,"weiß",null,null,null,null,"W"]
[null,"grau",null,null,null,null,"G"]
["Einstellung Luftlenkelement","Deckenstrahl D / E",null,null,null,null,{"$f":"VLOOKUP(B84,B85:G88,6,FALSE)","v":"D"}]
[null,"Deckenstrahl D / E",null,null,null,null,"D"]
[null,"Sondereinstellung",null,null,null,null,"S"]
[]
["Werkstoff Anschlusskasten","Stahl verzinkt",null,null,null,null,"V"]
[null,"Stahl verzinkt"]
["frontseitig bedienbare Drossel","ohne",null,null,null,{"$f":"VLOOKUP(B90,Einheiten!$A$50:$B$56,2,FALSE)","v":{"$error":"#N/A"}},{"$f":"VLOOKUP(B90,B91:G93,6,FALSE)","v":0}]
[null,"mit",null,null,null,null,1]
[null,"ohne",null,null,null,null,0]
["Innenauskleidung","Baustoffklasse B1 (Standard)",null,null,null,null,{"$f":"VLOOKUP(B93,B94:G97,6,FALSE)","v":"B1"}]
[null,"Baustoffklasse B1 (Standard)",null,null,null,null,"B1"]
[null,"Baustoffklasse A2 (optional)",null,null,null,null,"A2"]
[]
["Merkmalschlüssel",{"$f":"CONCATENATE(1,\"KSW\",\"0\",D18,G97,G75,\"A\",G79,G80,G84,G88,G90,G93,1,G98)","v":"1KSW0500DAL 358ZA9010SDV0B11100"},null,null,null,null,{"$f":"IF(D12<1000,CONCATENATE(0,D12),D12)","v":"DAL 358"}]
[null,null,null,null,null,null,{"$f":"IF(K41=78,\"080\",100)","v":100}]
["Calculation of air-velocities, Draught Ratings and acoustics",null,null,"Supply","Extract"]
["Pressure drop","Dpt","Pa",{"$f":"IF(D70=\"Supply\",Grunddaten!$N$33,\"\")","v":23.143459629611666},{"$f":"IF(D70=\"Extract\",IF(Grunddaten!O33=0,\"a. Anf\",Grunddaten!O33),\"\")","v":""}]
["Critical airflow distance","xkr.","m",{"$f":"IF(D70=\"Supply\",IF(D34>=D35,\"Heating mode\",Einheiten!$D$35),\"\")","v":"Heating mode"}]
["Laufweg bis Fußbodenbereich","xx","m",{"$f":"xkr._vx!L24","v":5.5}]
["Laufweg bis Aufenthaltsbereich nach Stoßpunkt","xx+y","m",{"$f":"xkr._vx!L26","v":2.2000000000000002}]
["Laufweg bis Aufenthaltsbereich nach xkrit","xxkr","m",{"$f":"IF(D34>=D35,\"Heizfall\",xkr._vx!L28)","v":"Heizfall"}]
["Air-velocity at the floor next to the wall","vx1","m/s",{"$f":"IF(D70=\"Supply\",IF(Einheiten!$D$36< 0.1,\"< 0,1\",Einheiten!$D$36),\"\")","v":"< 0,1"}]
["Draught Rating at the floor**","DR1","%",{"$f":"IF(D70=\"Supply\",IF($D$34>$D$35,\"heating mode\",Einheiten!$D$37),\"\")","v":"heating mode"}]
[{"$f":"IF(AND(D34>D35,OR(D12=\"MSA\",D12=\"DAL 358\")),\"Vertical penetration depth (Drum setting CD)\",\"Air-velocity in the habitation area*\")","v":"Vertical penetration depth (Drum setting CD)"},"vx2","m/s",{"$f":"IF(D70=\"Supply\",IF($D$34>$D$35,xkr._vx!M31,IF(xkr._vx!$N$26<0.1,\"< 0,1\",Einheiten!$D$38)),\"\")","v":"> room height"}]
["Draught Rating in the habitation area**","DR2","%",{"$f":"IF(D70=\"Supply\",IF($D$34>$D$35,\"heating mode\",Einheiten!D39),\"\")","v":"heating mode"}]
["Air-velocity after release at Xkr.","vx3","m/s",{"$f":"IF(D70=\"Supply\",IF(Einheiten!$D$40<0.1,\"<0,1\",IF($D$34>=$D$35,\"heating mode\",Einheiten!$D$40)),\"\")","v":"<0,1"}]
["Draught Rating after release at Xkr.**","DR3","%",{"$f":"IF(D70=\"Supply\",IF($D$34>=$D$35,\"heating mode\",Einheiten!$D$41),\"\")","v":"heating mode"}]
["Resulting room-category","RAL","[-]",{"$f":"IF(D70=\"Supply\",IF(D34>=D35,\"heating mode\",IF(AND($D$106<9.95,$D$108<9.95,$D$110<9.95),\"A\",IF(AND($D$106<19.95,$D$108<19.95,$D$110<19.95),\"B\",IF(AND($D$106<29.95,$D$108<29.95,$D$110<29.95),\"C\",\"Out of C\")))),\"\")","v":"heating mode"}]
[{"$f":"CONCATENATE(\"Sound power level, \",D70,\"-diffuser\")","v":"Sound power level, Supply-diffuser"},"LWA_SUP/ETA","dB(A)",{"$f":"IF(D70=\"Supply\",Lw!I89,\"\")","v":34.387930730561706},{"$f":"IF(D70=\"Extract\",IFERROR(Lw!I90,\"a. Anf\"),\"\")","v":""}]
["Schalldruckpegel, Zahlenwert Zuluft + Abluft",null,null,{"$f":"D112+10*LOG(Lw!$F$127/(4*PI()*Dimensioning!D73^2)+4/(Lw!$H$127))","v":23.211329290454778},{"$f":"E112+10*LOG(Lw!$F$127/(4*PI()*Dimensioning!E73^2)+4/(Lw!$H$127))","v":{"$error":"#VALUE!"}}]
[{"$f":"CONCATENATE(\"Sound pressure level in \",D73,\"m distance, \",D70,\"-diffuser\")","v":"Sound pressure level in 3m distance, Supply-diffuser"},"LPA_SUP/ETA","dB(A)",{"$f":"IF(D70=\"Supply\",IF(D112=\"<25\",\"<25\",IF(D112+10*LOG(Lw!$F$127/(4*PI()*Einheiten!$D$25^2)+4/(Lw!$H$127))>=25,D112+10*LOG(Lw!$F$127/(4*PI()*Einheiten!$D$25^2)+4/(Lw!$H$127)),\"<25\")),\"\")","v":"<25"},{"$f":"IF(D70=\"Extract\",IFERROR(IF(E112=\"<25\",\"<25\",IF(E112+10*LOG(Lw!$F$127/(4*PI()*Dimensioning!D73^2)+4/(Lw!$H$127))>=25,E112+10*LOG(Lw!$F$127/(4*PI()*Dimensioning!D73^2)+4/(Lw!$H$127)),\"<25\")),\"a. Anf\"),\"\")","v":""}]
["Schalldruckpegel rechnerisch ",null,null,{"$f":"IF(10*LOG(10^(D113/10)+10^(E113/10))<25,\"<25\",10*LOG(10^(D113/10)+10^(E113/10)))","v":{"$error":"#VALUE!"}}]
["Summen-Schallldruckpegel im betrachteten Punkt","LPA","dB(A)",{"$f":"IFERROR(IF(E113-D113>6,MAX(E113,D113),D115),IF(E114=\"a. Anf\",D114,IF(AND(D114=\"<25\",E114=\"<25\"),\"<25\",\"a. Anf\")))","v":"a. Anf"}]
["*Arrive of the air-stream in the habitation area after collision-point"]
["** Calculation according to DIN EN ISO 7730"]
[]
["Induction calculator","Symbol","Unit","Value"]
["Considered distance to diffuser","X(i)","ft",1]
["local air temperature in considered distance","DJSR","°F",{"$f":"Einheiten!$D$43","v":20.030864183479725},null,null,null,{"$f":"MIN((D42/2),D101)","v":1}]
["local air velocity in considered distance","vx","ft/min",{"$f":"Einheiten!$D$44","v":0.37834999999999996}]
["induction ratio","i"," -/-",{"$f":"DR!$F$38","v":9.8484848484848477}]
[]
["Sound Power Level, octave band","LW_Okt","dB",{"$f":"D99","v":"Supply"},{"$f":"E99","v":"Extract"}]
[null,"LW_125","dB",{"$f":"IF($D$70=\"Supply\",IFERROR(Lw!B$91,\"a. Anf\"),\"\")","v":35.708005571335946},{"$f":"IF($D$70=\"Extract\",IFERROR(Lw!B$92,\"a. Anf\"),\"\")","v":""}]
[null,"LW_250","dB",{"$f":"IF($D$70=\"Supply\",IFERROR(Lw!C$91,\"a. Anf\"),\"\")","v":35.64941713378321},{"$f":"IF($D$70=\"Extract\",IFERROR(Lw!C$92,\"a. Anf\"),\"\")","v":""}]
[null,"LW_500","dB",{"$f":"IF($D$70=\"Supply\",IFERROR(Lw!D$91,\"a. Anf\"),\"\")","v":32.254025864434048},{"$f":"IF($D$70=\"Extract\",IFERROR(Lw!D$92,\"a. Anf\"),\"\")","v":""}]
[null,"LW_1000","dB",{"$f":"IF($D$70=\"Supply\",IFERROR(Lw!E$91,\"a. Anf\"),\"\")","v":29.144019051104465},{"$f":"IF($D$70=\"Extract\",IFERROR(Lw!E$92,\"a. Anf\"),\"\")","v":""}]
[null,"LW_2000","dB",{"$f":"IF($D$70=\"Supply\",IFERROR(Lw!F$91,\"a. Anf\"),\"\")","v":22.479686572543091},{"$f":"IF($D$70=\"Extract\",IFERROR(Lw!F$92,\"a. Anf\"),\"\")","v":""}]
[null,"LW_4000","dB",{"$f":"IF($D$70=\"Supply\",IFERROR(Lw!G$91,\"a. Anf\"),\"\")","v":17.897365539973755},{"$f":"IF($D$70=\"Extract\",IFERROR(Lw!G$92,\"a. Anf\"),\"\")","v":""}]
[null,"LW_8000","dB",{"$f":"IF($D$70=\"Supply\",IFERROR(Lw!H$91,\"a. Anf\"),\"\")","v":13.316776843155013},{"$f":"IF($D$70=\"Extract\",IFERROR(Lw!H$92,\"a. Anf\"),\"\")","v":""}]
[]
["Subject to modifications"]
["Date:",null,null,null,{"$f":"IF(D12=500,KSW(),\"\")","v":""}]
[{"$f":"Grunddaten!E36","v":"2017-05-31"}]

{"sheet":"Funktion","index":3,"n_rows":0,"n_cols":0,"rows_kept":0,"cut":false,"hidden":true,"merged":[]}

{"sheet":"Maße","index":4,"n_rows":0,"n_cols":0,"rows_kept":0,"cut":false,"hidden":true,"merged":[]}

{"sheet":"Data sheet metric","index":5,"n_rows":44,"n_cols":9,"rows_kept":44,"cut":false,"hidden":true,"merged":[[28,2,28,3],[1,1,1,7],[5,2,5,4],[5,6,5,7],[9,0,9,8],[18,6,18,7],[22,2,22,3],[23,2,23,3],[24,2,24,3],[25,2,25,3],[26,2,26,3],[27,2,27,3],[29,2,29,3],[29,5,29,6],[30,2,30,3],[30,5,30,6],[31,2,31,3],[31,5,31,6],[32,2,32,3],[32,5,32,6],[33,2,33,3],[33,5,33,6],[34,2,34,3]]}
[]
["Type",{"$f":"Dimensioning!$D$12","v":"DAL 358"},null,null,null,null,null,null,{"$f":"TODAY()","v":"2019-11-14"}]
["Project","please enter Project-name / VIS-No."]
[]
["Definition:"]
["Diffuser, type:",{"$f":"Dimensioning!$D$12","v":"DAL 358"},"Nominal diameter:",null,null,{"$f":"Dimensioning!$D$18","v":500},"Hole pattern:",null,{"$f":"Dimensioning!D25","v":500}]
["Schlitzanzahl:",{"$f":"Dimensioning!D18","v":500},"Farbe Abdeckprofil:",null,{"$f":"Dimensioning!B79","v":9010}]
["Innenauskleidung:",{"$f":"Dimensioning!G93","v":"B1"},"Drossel fb:",null,{"$f":"Dimensioning!B90","v":"ohne"}]
[]
["Description:\nHighly inductive swirl diffuser for the installation in suspended ceilings.\nWith an optionally plenum box in square or round design.\n"]
["Range of application"]
["Minimum air-volume flow","V°min",{"$f":"Grunddaten!$H$33","v":200},"m³/h"]
["Maximum air-volume flow","V°max",{"$f":"Grunddaten!I33","v":800},"m³/h"]
[]
["Technical parameters",null,null,null,null,"Room-Specifications"]
["Supply air-volume flow","V·SUP",{"$f":"Einheiten!$D$18","v":350},"m³/h",null,"Height",{"$f":"Einheiten!$D$19","v":3},"m"]
["Temperature supply air","tZUL",{"$f":"Einheiten!D26","v":21},"°C",null,"Width",{"$f":"Einheiten!$D$21","v":10},"m"]
["Temperature room","tRoom",{"$f":"Einheiten!D27","v":20},"°C",null,"Length",{"$f":"Einheiten!D20","v":10},"m"]
[{"$f":"Dimensioning!A41","v":"Distance between diffuser and the next wall"},{"$f":"Dimensioning!B41","v":"a"},{"$f":"Einheiten!$D$23","v":2},"m",null,"Room type",{"$f":"Dimensioning!D45","v":"single office room"}]
[{"$f":"Dimensioning!A42","v":"Minimum distance between 2 diffusers"},"smin",{"$f":"Einheiten!$D$24","v":2},"m"]
[]
["Technical data"]
[{"$f":"CONCATENATE(\"Pressure drop \",Dimensioning!D70,\"-diffuser\")","v":"Pressure drop Supply-diffuser"},"Dp_SUP/ETA",{"$f":"IF(Dimensioning!D100=\"\",Dimensioning!E100,Dimensioning!D100)","v":23.143459629611666},null,"Pa"]
[{"$f":"Dimensioning!A101","v":"Critical airflow distance"},"xkr.",{"$f":"Einheiten!$B$35","v":4.2768019470436602},null,"m"]
[{"$f":"Dimensioning!A105","v":"Air-velocity at the floor next to the wall"},"vx1",{"$f":"IF(Einheiten!$B$36<0.1,\"<0,1\",Einheiten!$B$36)","v":"<0,1"},null,"m/s"]
[{"$f":"Dimensioning!A106","v":"Draught Rating at the floor**"},"DR1",{"$f":"Dimensioning!$D$106","v":"heating mode"},null,"%"]
[{"$f":"Dimensioning!A107","v":"Vertical penetration depth (Drum setting CD)"},"vx2",{"$f":"IF(Einheiten!$B$38<0.1,\"<0,1\",Einheiten!$B$38)","v":0.10859644087256025},null,"m/s"]
[{"$f":"Dimensioning!A108","v":"Draught Rating in the habitation area**"},"DR2",{"$f":"Dimensioning!D106","v":"heating mode"},null,"%"]
[{"$f":"Dimensioning!A109","v":"Air-velocity after release at Xkr."},"vx3",{"$f":"IF(Einheiten!B40<0.1,\"<0,1\",Einheiten!B40)","v":"<0,1"},null,"m/s","Dimensions"]
[{"$f":"Dimensioning!A110","v":"Draught Rating after release at Xkr.**"},"DR3",{"$f":"Dimensioning!D110","v":"heating mode"},null,"%",{"$f":"Dimensioning!J42","v":"min. quadr. front panel dimensions"},null,{"$f":"Dimensioning!K42","v":498},"mm"]
["Room category**","RAL",{"$f":"Dimensioning!D111","v":"heating mode"},null,{"$f":"\"-/-\"","v":"-/-"},{"$f":"Dimensioning!J43","v":"min. round front panel dimensions"},null,{"$f":"Dimensioning!K43","v":500},"mm"]
[{"$f":"Dimensioning!$A$112","v":"Sound power level, Supply-diffuser"},"LWA_SUP/ETA",{"$f":"IF(Dimensioning!D112=\"\",Dimensioning!E112,Dimensioning!D112)","v":34.387930730561706},null,"dB(A)",{"$f":"Dimensioning!J39","v":"Width, plenum box"},null,{"$f":"Dimensioning!K39","v":492},"mm"]
[{"$f":"Dimensioning!A114","v":"Sound pressure level in 3m distance, Supply-diffuser"},"LPA_SUP",{"$f":"IF(Dimensioning!D114=\"\",Dimensioning!E114,Dimensioning!D114)","v":"<25"},null,"dB(A)",{"$f":"Dimensioning!J40","v":"Height, plenum box"},null,{"$f":"Dimensioning!K40","v":340},"mm"]
[null,null,null,null,null,{"$f":"Dimensioning!J41","v":"Branch diameter"},null,{"$f":"Dimensioning!K41","v":225},"mm"]
[]
["*Arrive of the air-stream in the habitation area after collision-point"]
["**Room category according to DIN EN ISO 7730: DR<10 % = A; DR<20 % = B; DR<30 % = C"]
[]
[]
["Sound Power Level,                       octave band","f [Hz]",125,250,500,1000,2000,4000,8000]
[{"$f":"Dimensioning!D70","v":"Supply"},"LWA_Okt",{"$f":"IF(Dimensioning!$D$127=\"\",Dimensioning!$E$127,Dimensioning!$D$127)","v":35.708005571335946},{"$f":"IF(Dimensioning!$D$128=\"\",Dimensioning!$E$128,Dimensioning!$D$128)","v":35.64941713378321},{"$f":"IF(Dimensioning!$D$129=\"\",Dimensioning!$E$129,Dimensioning!$D$129)","v":32.254025864434048},{"$f":"IF(Dimensioning!$D$130=\"\",Dimensioning!$E$130,Dimensioning!$D$130)","v":29.144019051104465},{"$f":"IF(Dimensioning!$D$131=\"\",Dimensioning!$E$131,Dimensioning!$D$131)","v":22.479686572543091},{"$f":"IF(Dimensioning!$D$132=\"\",Dimensioning!$E$132,Dimensioning!$D$132)","v":17.897365539973755},{"$f":"IF(Dimensioning!$D$133=\"\",Dimensioning!$E$133,Dimensioning!$D$133)","v":13.316776843155013}]
[]
[null,null,null,null,null,null,null,null,"Subject to modifications"]
[null,null,null,null,null,null,null,"Date:",{"$f":"Grunddaten!$E$36","v":"2017-05-31"}]

{"sheet":"Data sheet","index":6,"n_rows":44,"n_cols":9,"rows_kept":44,"cut":false,"hidden":false,"merged":[[34,2,34,3],[33,5,33,6],[33,2,33,3],[9,0,9,8],[18,6,18,7],[29,5,29,6],[30,5,30,6],[31,5,31,6],[1,1,1,7],[32,2,32,3],[32,5,32,6],[22,2,22,3],[23,2,23,3],[24,2,24,3],[25,2,25,3],[26,2,26,3],[27,2,27,3],[28,2,28,3],[29,2,29,3],[30,2,30,3],[31,2,31,3],[5,6,5,7],[5,2,5,4]]}
[]
["Type",{"$f":"Dimensioning!$D$12","v":"DAL 358"},null,null,null,null,null,null,{"$f":"TODAY()","v":"2019-11-14"}]
["Project","please enter Project-name / VIS-No."]
[]
["Definition:"]
["Diffuser, type:",{"$f":"Dimensioning!$D$12","v":"DAL 358"},"Nominal diameter:",null,null,{"$f":"Dimensioning!$D$18","v":500},"Hole pattern:",null,{"$f":"Dimensioning!D25","v":500}]
["Schlitzanzahl:",{"$f":"Dimensioning!D18","v":500},"Farbe Abdeckprofil:",null,{"$f":"Dimensioning!B79","v":9010}]
["Innenauskleidung:",{"$f":"Dimensioning!G93","v":"B1"},"Drossel fb:",null,{"$f":"Dimensioning!B90","v":"ohne"}]
[]
["Description:\nHighly inductive swirl diffuser for the installation in suspended ceilings.\nWith an optionally plenum box in square or round design.\n"]
["Range of application"]
["Minimum air-volume flow","V°min",{"$f":"Dimensioning!K44","v":200},"m³/h"]
["Maximum air-volume flow","V°max",{"$f":"Dimensioning!K45","v":800},"m³/h"]
[]
["Technical parameters",null,null,null,null,"Room-Specifications"]
["Supply air-volume flow","V·SUP",{"$f":"Dimensioning!D32","v":350},"m³/h",null,"Height",{"$f":"Dimensioning!D37","v":3},"m"]
["Temperature supply air","tZUL",{"$f":"Dimensioning!D34","v":21},"°C",null,"Width",{"$f":"Dimensioning!D40","v":10},"m"]
["Temperature room","tRoom",{"$f":"Dimensioning!D35","v":20},"°C",null,"Length",{"$f":"Dimensioning!D39","v":10},"m"]
[{"$f":"Dimensioning!A41","v":"Distance between diffuser and the next wall"},{"$f":"Dimensioning!B41","v":"a"},{"$f":"Dimensioning!D41","v":2},"m",null,"Room type",{"$f":"Dimensioning!D45","v":"single office room"}]
[{"$f":"Dimensioning!A42","v":"Minimum distance between 2 diffusers"},"smin",{"$f":"Dimensioning!D42","v":2}," m"]
[]
["Technical data"]
[{"$f":"CONCATENATE(\"Pressure drop \",Dimensioning!D70,\"durchlass\")","v":"Pressure drop Supplydurchlass"},"Dp_SUP/ETA",{"$f":"IF(Dimensioning!D100=\"\",Dimensioning!E100,Dimensioning!D100)","v":23.143459629611666},null,"Pa"]
[{"$f":"Dimensioning!A101","v":"Critical airflow distance"},"xkr.",{"$f":"Dimensioning!D101","v":"Heating mode"},null,"m"]
[{"$f":"Dimensioning!A105","v":"Air-velocity at the floor next to the wall"},"vx1",{"$f":"Dimensioning!D105","v":"< 0,1"},null,"m/s"]
[{"$f":"Dimensioning!A106","v":"Draught Rating at the floor**"},"DR1",{"$f":"Dimensioning!$D$106","v":"heating mode"},null,"%"]
[{"$f":"Dimensioning!A107","v":"Vertical penetration depth (Drum setting CD)"},"vx2",{"$f":"Dimensioning!$D$107","v":"> room height"},null,"m/s"]
[{"$f":"Dimensioning!A108","v":"Draught Rating in the habitation area**"},"DR2",{"$f":"Dimensioning!D106","v":"heating mode"},null,"%"]
[{"$f":"Dimensioning!A109","v":"Air-velocity after release at Xkr."},"vx3",{"$f":"Dimensioning!$D$109","v":"<0,1"},null,"m/s","Dimensions"]
[{"$f":"Dimensioning!A110","v":"Draught Rating after release at Xkr.**"},"DR3",{"$f":"Dimensioning!D110","v":"heating mode"},null,"%",{"$f":"Dimensioning!J42","v":"min. quadr. front panel dimensions"},null,{"$f":"Dimensioning!K42","v":498},"mm"]
["Room category**","RAL",{"$f":"Dimensioning!D111","v":"heating mode"},null,{"$f":"\"-/-\"","v":"-/-"},{"$f":"Dimensioning!J43","v":"min. round front panel dimensions"},null,{"$f":"Dimensioning!$K$43","v":500},"mm"]
[{"$f":"Dimensioning!$A$112","v":"Sound power level, Supply-diffuser"},"LWA_SUP/ETA",{"$f":"IF(Dimensioning!D112=\"\",Dimensioning!E112,Dimensioning!D112)","v":34.387930730561706},null,"dB(A)",{"$f":"Dimensioning!J39","v":"Width, plenum box"},null,{"$f":"Dimensioning!$K$39","v":492},"mm"]
[{"$f":"Dimensioning!A114","v":"Sound pressure level in 3m distance, Supply-diffuser"},"LPA_SUP",{"$f":"IF(Dimensioning!D114=\"\",Dimensioning!E114,Dimensioning!D114)","v":"<25"},null,"dB(A)",{"$f":"Dimensioning!J40","v":"Height, plenum box"},null,{"$f":"Dimensioning!$K$40","v":340},"mm"]
[null,null,null,null,null,{"$f":"Dimensioning!J41","v":"Branch diameter"},null,{"$f":"Dimensioning!$K$41","v":225},"mm"]
[]
["*Arrive of the air-stream in the habitation area after collision-point"]
["**Room category according to DIN EN ISO 7730: DR<10 % = A; DR<20 % = B; DR<30 % = C"]
[]
[]
["Sound Power Level,                       octave band","f [Hz]",125,250,500,1000,2000,4000,8000]
[{"$f":"Dimensioning!D70","v":"Supply"},"LWA_Okt",{"$f":"IF(Dimensioning!$D$127=\"\",Dimensioning!$E$127,Dimensioning!$D$127)","v":35.708005571335946},{"$f":"IF(Dimensioning!$D$128=\"\",Dimensioning!$E$128,Dimensioning!$D$128)","v":35.64941713378321},{"$f":"IF(Dimensioning!$D$129=\"\",Dimensioning!$E$129,Dimensioning!$D$129)","v":32.254025864434048},{"$f":"IF(Dimensioning!$D$130=\"\",Dimensioning!$E$130,Dimensioning!$D$130)","v":29.144019051104465},{"$f":"IF(Dimensioning!$D$131=\"\",Dimensioning!$E$131,Dimensioning!$D$131)","v":22.479686572543091},{"$f":"IF(Dimensioning!$D$132=\"\",Dimensioning!$E$132,Dimensioning!$D$132)","v":17.897365539973755},{"$f":"IF(Dimensioning!$D$133=\"\",Dimensioning!$E$133,Dimensioning!$D$133)","v":13.316776843155013}]
[]
[null,null,null,null,null,null,null,null,"Subject to modifications"]
[null,null,null,null,null,null,null,"Date:",{"$f":"Grunddaten!$E$36","v":"2017-05-31"}]

{"sheet":"Grunddaten","index":7,"n_rows":52,"n_cols":31,"rows_kept":52,"cut":false,"hidden":true,"merged":[[1,19,1,20],[0,19,0,25],[1,21,1,25],[0,27,0,30]]}
["Typ","DN",null,"Originalbez.","Schlitzanzahl","Schlitzlänge","Soll-Volumenstrom","V° Auslegung min","V° Auslegung max","V° Auslegung min","V° Auslegung max","Durchmesser Anschluss","Anströmgeschwindigkeit","Druckverlust, Zuluft","Druckverlust, Abluft","Höhe Anschlusskasten","Breite Anschlusskasten","min. Abmessungen Frontblende quadratisch","min. Abmessungen Frontblende rund","Vorauswahlkriterien",null,null,null,null,null,null,null,"Vorauswahl zur Anzeige"]
[null,"Lochbild",null,"l","n","L","V°","V°min","V°max","V°min","V°max","d","v","Dp","Dp","h","b","b1","x","Volumenstrom",null,"Schallleistungspegel",null,null,null,null,"Auslass freigegeben?"]
[null,null,null,"mm",1,"mm","m³/h","m³/h","m³/h","ft³/min","ft³/min","mm","m/s","Pa","Pa","mm","mm","mm","mm","größer als v°min?","kleiner als V°max?","K021","K022","dB","größer als 0dB(A)?","kleiner als LW,Amax?",null,null,null,{"$f":"IF(ROW(AC3)>COUNTA(AC:AC),\"\",INDEX(AC3:AC28,SMALL(IF(AC$4:AC$29<>\"\",ROW($4:$29)),ROW($AC3))))","v":""}]
["DAL 359",300,{"$f":"CONCATENATE(A4,B4)","v":"DAL 359300"},"DAL 359",null,null,{"$f":"Einheiten!$D$18","v":350},50,300,{"$f":"H4/Einheiten!$E$11","v":50},{"$f":"I4/Einheiten!$E$11","v":300},160,{"$f":"Dimensioning!$D$32/(PI()/4*(Grunddaten!L4/1000)^2*3600)","v":4.835436639076681},{"$f":"SUM('DAL359-CAP'!$C$42,'DAL358-CAP'!$C$42,'DRS-CAP'!$C$42,'DIA-CAP'!$C$42,'MSA-CAP'!$C$42)*Grunddaten!G4^(SUM('DAL359-CAP'!$C$43,'DAL358-CAP'!$C$43,'DRS-CAP'!$C$43,'DIA-CAP'!$C$43,'MSA-CAP'!$C$43))","v":23.143459629611666},{"$f":"SUM('DAL359-CAP'!$C$70,'DAL358-CAP'!$C$70,'DRS-CAP'!$C$70,'DIA-CAP'!$C$70,'MSA-CAP'!$C$70)*Grunddaten!G4^(SUM('DAL359-CAP'!$C$71,'DAL358-CAP'!$C$71,'DRS-CAP'!$C$71,'DIA-CAP'!$C$71,'MSA-CAP'!$C$71))","v":19.217978687974494},275,292,298,300,{"$f":"IF(Einheiten!$D$18>=Grunddaten!J4,\"x\",\"\")","v":"x"},{"$f":"IF(Einheiten!$D$18<=Grunddaten!K4,\"x\",\"\")","v":""},-93.241728860158958,61.295195452125157,{"$f":"V4+W4*LOG(Einheiten!$D$18)","v":62.697419161797001},{"$f":"IF(X4>0,\"x\",\"\")","v":"x"},{"$f":"IF(X4<=Specifications!$D$12,\"x\",\"\")","v":""},"x",{"$f":"IF(AND(T4=\"x\",U4=\"x\",Y4=\"x\",Z4=\"x\",AA4=\"x\"),\"x\",\"\")","v":""},{"$f":"IF(AB4=\"x\",CONCATENATE(A4,\" DN \",B4),\"\")","v":""},{"$f":"IF(ROW(AC1)>COUNTA(AC:AC),\"\",INDEX(AC:AC,SMALL(IF(AC$1:AC$29<>\"\",ROW($1:$29)),ROW($AC1))))","v":"DAL 359 DN 400"},{"$f":"IFERROR(AD4,\"\")","v":"DAL 359 DN 400"}]
["DAL 359",400,{"$f":"CONCATENATE(A5,B5)","v":"DAL 359400"},"DAL 359",null,null,{"$f":"Einheiten!$D$18","v":350},200,500,{"$f":"H5/Einheiten!$E$11","v":200},{"$f":"I5/Einheiten!$E$11","v":500},200,{"$f":"Dimensioning!$D$32/(PI()/4*(Grunddaten!L5/1000)^2*3600)","v":3.0946794490090759},{"$f":"SUM('DAL359-CAP'!$C$42,'DAL358-CAP'!$C$42,'DRS-CAP'!$C$42,'DIA-CAP'!$C$42,'MSA-CAP'!$C$42)*Grunddaten!G5^(SUM('DAL359-CAP'!$C$43,'DAL358-CAP'!$C$43,'DRS-CAP'!$C$43,'DIA-CAP'!$C$43,'MSA-CAP'!$C$43))","v":23.143459629611666},{"$f":"SUM('DAL359-CAP'!$C$70,'DAL358-CAP'!$C$70,'DRS-CAP'!$C$70,'DIA-CAP'!$C$70,'MSA-CAP'!$C$70)*Grunddaten!G5^(SUM('DAL359-CAP'!$C$71,'DAL358-CAP'!$C$71,'DRS-CAP'!$C$71,'DIA-CAP'!$C$71,'MSA-CAP'!$C$71))","v":19.217978687974494},315,392,398,400,{"$f":"IF(Einheiten!$D$18>=Grunddaten!J5,\"x\",\"\")","v":"x"},{"$f":"IF(Einheiten!$D$18<=Grunddaten!K5,\"x\",\"\")","v":"x"},-113.4,58.16,{"$f":"V5+W5*LOG(Einheiten!$D$18)","v":34.562997459412031},{"$f":"IF(X5>0,\"x\",\"\")","v":"x"},{"$f":"IF(X5<=Specifications!$D$12,\"x\",\"\")","v":"x"},"x",{"$f":"IF(AND(T5=\"x\",U5=\"x\",Y5=\"x\",Z5=\"x\",AA5=\"x\"),\"x\",\"\")","v":"x"},{"$f":"IF(AB5=\"x\",CONCATENATE(A5,\" DN \",B5),\"\")","v":"DAL 359 DN 400"},{"$f":"IF(ROW(AC2)>COUNTA(AC:AC),\"\",INDEX(AC:AC,SMALL(IF(AC$1:AC$29<>\"\",ROW($1:$29)),ROW($AC2))))","v":"DAL 359 DN 500"},{"$f":"IFERROR(AD5,\"\")","v":"DAL 359 DN 500"}]
["DAL 359",500,"DAL 359500","DAL 359",null,null,{"$f":"Einheiten!$D$18","v":350},300,700,{"$f":"H6/Einheiten!$E$11","v":300},{"$f":"I6/Einheiten!$E$11","v":700},225,{"$f":"Dimensioning!$D$32/(PI()/4*(Grunddaten!L6/1000)^2*3600)","v":2.4451788239084054},{"$f":"SUM('DAL359-CAP'!$C$42,'DAL358-CAP'!$C$42,'DRS-CAP'!$C$42,'DIA-CAP'!$C$42,'MSA-CAP'!$C$42)*Grunddaten!G6^(SUM('DAL359-CAP'!$C$43,'DAL358-CAP'!$C$43,'DRS-CAP'!$C$43,'DIA-CAP'!$C$43,'MSA-CAP'!$C$43))","v":23.143459629611666},{"$f":"SUM('DAL359-CAP'!$C$70,'DAL358-CAP'!$C$70,'DRS-CAP'!$C$70,'DIA-CAP'!$C$70,'MSA-CAP'!$C$70)*Grunddaten!G6^(SUM('DAL359-CAP'!$C$71,'DAL358-CAP'!$C$71,'DRS-CAP'!$C$71,'DIA-CAP'!$C$71,'MSA-CAP'!$C$71))","v":19.217978687974494},340,492,498,500,{"$f":"IF(Einheiten!$D$18>=Grunddaten!J6,\"x\",\"\")","v":"x"},{"$f":"IF(Einheiten!$D$18<=Grunddaten!K6,\"x\",\"\")","v":"x"},-125.2,58.87,{"$f":"V6+W6*LOG(Einheiten!$D$18)","v":24.56928577090072},"x",{"$f":"IF(X6<=Specifications!$D$12,\"x\",\"\")","v":"x"},"x","x","DAL 359 DN 500",{"$f":"IF(ROW(AC3)>COUNTA(AC:AC),\"\",INDEX(AC:AC,SMALL(IF(AC$1:AC$29<>\"\",ROW($1:$29)),ROW($AC3))))","v":"DAL 358 DN 500"},"DAL 358 DN 500"]
["DAL 359",600,"DAL 359600","DAL 359",null,null,{"$f":"Einheiten!$D$18","v":350},500,1200,{"$f":"H7/Einheiten!$E$11","v":500},{"$f":"I7/Einheiten!$E$11","v":1200},250,{"$f":"Dimensioning!$D$32/(PI()/4*(Grunddaten!L7/1000)^2*3600)","v":1.9805948473658088},{"$f":"SUM('DAL359-CAP'!$C$42,'DAL358-CAP'!$C$42,'DRS-CAP'!$C$42,'DIA-CAP'!$C$42,'MSA-CAP'!$C$42)*Grunddaten!G7^(SUM('DAL359-CAP'!$C$43,'DAL358-CAP'!$C$43,'DRS-CAP'!$C$43,'DIA-CAP'!$C$43,'MSA-CAP'!$C$43))","v":23.143459629611666},{"$f":"SUM('DAL359-CAP'!$C$70,'DAL358-CAP'!$C$70,'DRS-CAP'!$C$70,'DIA-CAP'!$C$70,'MSA-CAP'!$C$70)*Grunddaten!G7^(SUM('DAL359-CAP'!$C$71,'DAL358-CAP'!$C$71,'DRS-CAP'!$C$71,'DIA-CAP'!$C$71,'MSA-CAP'!$C$71))","v":19.217978687974494},365,614,595,600,{"$f":"IF(Einheiten!$D$18>=Grunddaten!J7,\"x\",\"\")","v":""},{"$f":"IF(Einheiten!$D$18<=Grunddaten!K7,\"x\",\"\")","v":"x"},-142.40600000000001,63.15,{"$f":"V7+W7*LOG(Einheiten!$D$18)","v":18.251897000719907},"x",{"$f":"IF(X7<=Specifications!$D$12,\"x\",\"\")","v":"x"},"x","","",{"$f":"IF(ROW(AC4)>COUNTA(AC:AC),\"\",INDEX(AC:AC,SMALL(IF(AC$1:AC$29<>\"\",ROW($1:$29)),ROW($AC4))))","v":"DAL 358 DN 600"},"DAL 358 DN 600"]
["DAL 359",800,"DAL 359800","DAL 359",null,null,{"$f":"Einheiten!$D$18","v":350},800,2000,{"$f":"H8/Einheiten!$E$11","v":800},{"$f":"I8/Einheiten!$E$11","v":2000},315,{"$f":"Dimensioning!$D$32/(PI()/4*(Grunddaten!L8/1000)^2*3600)","v":1.2475402162797988},{"$f":"SUM('DAL359-CAP'!$C$42,'DAL358-CAP'!$C$42,'DRS-CAP'!$C$42,'DIA-CAP'!$C$42,'MSA-CAP'!$C$42)*Grunddaten!G8^(SUM('DAL359-CAP'!$C$43,'DAL358-CAP'!$C$43,'DRS-CAP'!$C$43,'DIA-CAP'!$C$43,'MSA-CAP'!$C$43))","v":23.143459629611666},{"$f":"SUM('DAL359-CAP'!$C$70,'DAL358-CAP'!$C$70,'DRS-CAP'!$C$70,'DIA-CAP'!$C$70,'MSA-CAP'!$C$70)*Grunddaten!G8^(SUM('DAL359-CAP'!$C$71,'DAL358-CAP'!$C$71,'DRS-CAP'!$C$71,'DIA-CAP'!$C$71,'MSA-CAP'!$C$71))","v":19.217978687974494},430,794,800,800,{"$f":"IF(Einheiten!$D$18>=Grunddaten!J8,\"x\",\"\")","v":""},{"$f":"IF(Einheiten!$D$18<=Grunddaten!K8,\"x\",\"\")","v":"x"},-142.9,56.58,{"$f":"V8+W8*LOG(Einheiten!$D$18)","v":1.0433699493385973},"x",{"$f":"IF(X8<=Specifications!$D$12,\"x\",\"\")","v":"x"},"x","","",{"$f":"IF(ROW(AC5)>COUNTA(AC:AC),\"\",INDEX(AC:AC,SMALL(IF(AC$1:AC$29<>\"\",ROW($1:$29)),ROW($AC5))))","v":"DRS DN 250"},"DRS DN 250"]
["DAL 358",300,"DAL 358300","DAL 358",null,null,{"$f":"Einheiten!$D$18","v":350},40,250,{"$f":"H9/Einheiten!$E$11","v":40},{"$f":"I9/Einheiten!$E$11","v":250},160,{"$f":"Dimensioning!$D$32/(PI()/4*(Grunddaten!L9/1000)^2*3600)","v":4.835436639076681},{"$f":"SUM('DAL359-CAP'!$C$42,'DAL358-CAP'!$C$42,'DRS-CAP'!$C$42,'DIA-CAP'!$C$42,'MSA-CAP'!$C$42)*Grunddaten!G9^(SUM('DAL359-CAP'!$C$43,'DAL358-CAP'!$C$43,'DRS-CAP'!$C$43,'DIA-CAP'!$C$43,'MSA-CAP'!$C$43))","v":23.143459629611666},{"$f":"SUM('DAL359-CAP'!$C$70,'DAL358-CAP'!$C$70,'DRS-CAP'!$C$70,'DIA-CAP'!$C$70,'MSA-CAP'!$C$70)*Grunddaten!G9^(SUM('DAL359-CAP'!$C$71,'DAL358-CAP'!$C$71,'DRS-CAP'!$C$71,'DIA-CAP'!$C$71,'MSA-CAP'!$C$71))","v":19.217978687974494},275,292,298,300,{"$f":"IF(Einheiten!$D$18>=Grunddaten!J9,\"x\",\"\")","v":"x"},{"$f":"IF(Einheiten!$D$18<=Grunddaten!K9,\"x\",\"\")","v":""},-65.683763355297202,48.466188743658236,{"$f":"V9+W9*LOG(Einheiten!$D$18)","v":57.617518658892749},"x",{"$f":"IF(X9<=Specifications!$D$12,\"x\",\"\")","v":""},"x","","",{"$f":"IF(ROW(AC6)>COUNTA(AC:AC),\"\",INDEX(AC:AC,SMALL(IF(AC$1:AC$29<>\"\",ROW($1:$29)),ROW($AC6))))","v":"DRS DN 315"},"DRS DN 315"]
["DAL 358",400,"DAL 358400","DAL 358",null,null,{"$f":"Einheiten!$D$18","v":350},130,700,{"$f":"H10/Einheiten!$E$11","v":130},{"$f":"I10/Einheiten!$E$11","v":700},200,{"$f":"Dimensioning!$D$32/(PI()/4*(Grunddaten!L10/1000)^2*3600)","v":3.0946794490090759},{"$f":"SUM('DAL359-CAP'!$C$42,'DAL358-CAP'!$C$42,'DRS-CAP'!$C$42,'DIA-CAP'!$C$42,'MSA-CAP'!$C$42)*Grunddaten!G10^(SUM('DAL359-CAP'!$C$43,'DAL358-CAP'!$C$43,'DRS-CAP'!$C$43,'DIA-CAP'!$C$43,'MSA-CAP'!$C$43))","v":23.143459629611666},{"$f":"SUM('DAL359-CAP'!$C$70,'DAL358-CAP'!$C$70,'DRS-CAP'!$C$70,'DIA-CAP'!$C$70,'MSA-CAP'!$C$70)*Grunddaten!G10^(SUM('DAL359-CAP'!$C$71,'DAL358-CAP'!$C$71,'DRS-CAP'!$C$71,'DIA-CAP'!$C$71,'MSA-CAP'!$C$71))","v":19.217978687974494},315,392,398,400,{"$f":"IF(Einheiten!$D$18>=Grunddaten!J10,\"x\",\"\")","v":"x"},{"$f":"IF(Einheiten!$D$18<=Grunddaten!K10,\"x\",\"\")","v":"x"},-97.77,56.79,{"$f":"V10+W10*LOG(Einheiten!$D$18)","v":46.707624238652144},"x",{"$f":"IF(X10<=Specifications!$D$12,\"x\",\"\")","v":""},"x","",{"$f":"IF(AB10=\"x\",CONCATENATE(A10,\" DN \",B10),\"\")","v":""},{"$f":"IF(ROW(AC7)>COUNTA(AC:AC),\"\",INDEX(AC:AC,SMALL(IF(AC$1:AC$29<>\"\",ROW($1:$29)),ROW($AC7))))","v":"DRS DN 355"},"DRS DN 355"]
["DAL 358",500,"DAL 358500","DAL 358",null,null,{"$f":"Einheiten!$D$18","v":350},200,800,{"$f":"H11/Einheiten!$E$11","v":200},{"$f":"I11/Einheiten!$E$11","v":800},225,{"$f":"Dimensioning!$D$32/(PI()/4*(Grunddaten!L11/1000)^2*3600)","v":2.4451788239084054},{"$f":"SUM('DAL359-CAP'!$C$42,'DAL358-CAP'!$C$42,'DRS-CAP'!$C$42,'DIA-CAP'!$C$42,'MSA-CAP'!$C$42)*Grunddaten!G11^(SUM('DAL359-CAP'!$C$43,'DAL358-CAP'!$C$43,'DRS-CAP'!$C$43,'DIA-CAP'!$C$43,'MSA-CAP'!$C$43))","v":23.143459629611666},{"$f":"SUM('DAL359-CAP'!$C$70,'DAL358-CAP'!$C$70,'DRS-CAP'!$C$70,'DIA-CAP'!$C$70,'MSA-CAP'!$C$70)*Grunddaten!G11^(SUM('DAL359-CAP'!$C$71,'DAL358-CAP'!$C$71,'DRS-CAP'!$C$71,'DIA-CAP'!$C$71,'MSA-CAP'!$C$71))","v":19.217978687974494},340,492,498,500,{"$f":"IF(Einheiten!$D$18>=Grunddaten!J11,\"x\",\"\")","v":"x"},{"$f":"IF(Einheiten!$D$18<=Grunddaten!K11,\"x\",\"\")","v":"x"},-124.54,62.47,{"$f":"V11+W11*LOG(Einheiten!$D$18)","v":34.387930730561706},"x",{"$f":"IF(X11<=Specifications!$D$12,\"x\",\"\")","v":"x"},"x","x","DAL 358 DN 500",{"$f":"IF(ROW(AC8)>COUNTA(AC:AC),\"\",INDEX(AC:AC,SMALL(IF(AC$1:AC$29<>\"\",ROW($1:$29)),ROW($AC8))))","v":"MSA DN 500"},"MSA DN 500"]
["DAL 358",600,"DAL 358600","DAL 358",null,null,{"$f":"Einheiten!$D$18","v":350},300,1000,{"$f":"H12/Einheiten!$E$11","v":300},{"$f":"I12/Einheiten!$E$11","v":1000},250,{"$f":"Dimensioning!$D$32/(PI()/4*(Grunddaten!L12/1000)^2*3600)","v":1.9805948473658088},{"$f":"SUM('DAL359-CAP'!$C$42,'DAL358-CAP'!$C$42,'DRS-CAP'!$C$42,'DIA-CAP'!$C$42,'MSA-CAP'!$C$42)*Grunddaten!G12^(SUM('DAL359-CAP'!$C$43,'DAL358-CAP'!$C$43,'DRS-CAP'!$C$43,'DIA-CAP'!$C$43,'MSA-CAP'!$C$43))","v":23.143459629611666},{"$f":"SUM('DAL359-CAP'!$C$70,'DAL358-CAP'!$C$70,'DRS-CAP'!$C$70,'DIA-CAP'!$C$70,'MSA-CAP'!$C$70)*Grunddaten!G12^(SUM('DAL359-CAP'!$C$71,'DAL358-CAP'!$C$71,'DRS-CAP'!$C$71,'DIA-CAP'!$C$71,'MSA-CAP'!$C$71))","v":19.217978687974494},365,614,595,600,{"$f":"IF(Einheiten!$D$18>=Grunddaten!J12,\"x\",\"\")","v":"x"},{"$f":"IF(Einheiten!$D$18<=Grunddaten!K12,\"x\",\"\")","v":"x"},-136.30000000000001,63.1,{"$f":"V12+W12*LOG(Einheiten!$D$18)","v":24.230693598502398},"x",{"$f":"IF(X12<=Specifications!$D$12,\"x\",\"\")","v":"x"},"x","x","DAL 358 DN 600",{"$f":"IF(ROW(AC9)>COUNTA(AC:AC),\"\",INDEX(AC:AC,SMALL(IF(AC$1:AC$29<>\"\",ROW($1:$29)),ROW($AC9))))","v":"MSA DN 600"},"MSA DN 600"]
["DAL 358",800,"DAL 358800","DAL 358",null,null,{"$f":"Einheiten!$D$18","v":350},400,1750,{"$f":"H13/Einheiten!$E$11","v":400},{"$f":"I13/Einheiten!$E$11","v":1750},315,{"$f":"Dimensioning!$D$32/(PI()/4*(Grunddaten!L13/1000)^2*3600)","v":1.2475402162797988},{"$f":"SUM('DAL359-CAP'!$C$42,'DAL358-CAP'!$C$42,'DRS-CAP'!$C$42,'DIA-CAP'!$C$42,'MSA-CAP'!$C$42)*Grunddaten!G13^(SUM('DAL359-CAP'!$C$43,'DAL358-CAP'!$C$43,'DRS-CAP'!$C$43,'DIA-CAP'!$C$43,'MSA-CAP'!$C$43))","v":23.143459629611666},{"$f":"SUM('DAL359-CAP'!$C$70,'DAL358-CAP'!$C$70,'DRS-CAP'!$C$70,'DIA-CAP'!$C$70,'MSA-CAP'!$C$70)*Grunddaten!G13^(SUM('DAL359-CAP'!$C$71,'DAL358-CAP'!$C$71,'DRS-CAP'!$C$71,'DIA-CAP'!$C$71,'MSA-CAP'!$C$71))","v":19.217978687974494},430,794,800,800,{"$f":"IF(Einheiten!$D$18>=Grunddaten!J13,\"x\",\"\")","v":""},{"$f":"IF(Einheiten!$D$18<=Grunddaten!K13,\"x\",\"\")","v":"x"},-141.4,62.47,{"$f":"V13+W13*LOG(Einheiten!$D$18)","v":17.527930730561707},"x",{"$f":"IF(X13<=Specifications!$D$12,\"x\",\"\")","v":"x"},"x","","",{"$f":"IF(ROW(AC10)>COUNTA(AC:AC),\"\",INDEX(AC:AC,SMALL(IF(AC$1:AC$29<>\"\",ROW($1:$29)),ROW($AC10))))","v":{"$error":"#NUM!"}},""]
["DRS",100,"DRS100","DRS",null,null,{"$f":"Einheiten!$D$18","v":350},25,100,{"$f":"H14/Einheiten!$E$11","v":25},{"$f":"I14/Einheiten!$E$11","v":100},100,{"$f":"Dimensioning!$D$32/(PI()/4*(Grunddaten!L14/1000)^2*3600)","v":12.378717796036304},{"$f":"SUM('DAL359-CAP'!$C$42,'DAL358-CAP'!$C$42,'DRS-CAP'!$C$42,'DIA-CAP'!$C$42,'MSA-CAP'!$C$42)*Grunddaten!G14^(SUM('DAL359-CAP'!$C$43,'DAL358-CAP'!$C$43,'DRS-CAP'!$C$43,'DIA-CAP'!$C$43,'MSA-CAP'!$C$43))","v":23.143459629611666},{"$f":"SUM('DAL359-CAP'!$C$70,'DAL358-CAP'!$C$70,'DRS-CAP'!$C$70,'DIA-CAP'!$C$70,'MSA-CAP'!$C$70)*Grunddaten!G14^(SUM('DAL359-CAP'!$C$71,'DAL358-CAP'!$C$71,'DRS-CAP'!$C$71,'DIA-CAP'!$C$71,'MSA-CAP'!$C$71))","v":19.217978687974494},177,122,620,155,{"$f":"IF(Einheiten!$D$18>=Grunddaten!J14,\"x\",\"\")","v":"x"},{"$f":"IF(Einheiten!$D$18<=Grunddaten!K14,\"x\",\"\")","v":""},-63.18,49.43,{"$f":"V14+W14*LOG(Einheiten!$D$18)","v":62.573283432234128},"x",{"$f":"IF(X14<=Specifications!$D$12,\"x\",\"\")","v":""},"x","","",{"$f":"IF(ROW(AC11)>COUNTA(AC:AC),\"\",INDEX(AC:AC,SMALL(IF(AC$1:AC$29<>\"\",ROW($1:$29)),ROW($AC11))))","v":{"$error":"#NUM!"}},""]
["DRS",125,"DRS125","DRS",null,null,{"$f":"Einheiten!$D$18","v":350},50,150,{"$f":"H15/Einheiten!$E$11","v":50},{"$f":"I15/Einheiten!$E$11","v":150},125,{"$f":"Dimensioning!$D$32/(PI()/4*(Grunddaten!L15/1000)^2*3600)","v":7.9223793894632353},{"$f":"SUM('DAL359-CAP'!$C$42,'DAL358-CAP'!$C$42,'DRS-CAP'!$C$42,'DIA-CAP'!$C$42,'MSA-CAP'!$C$42)*Grunddaten!G15^(SUM('DAL359-CAP'!$C$43,'DAL358-CAP'!$C$43,'DRS-CAP'!$C$43,'DIA-CAP'!$C$43,'MSA-CAP'!$C$43))","v":23.143459629611666},{"$f":"SUM('DAL359-CAP'!$C$70,'DAL358-CAP'!$C$70,'DRS-CAP'!$C$70,'DIA-CAP'!$C$70,'MSA-CAP'!$C$70)*Grunddaten!G15^(SUM('DAL359-CAP'!$C$71,'DAL358-CAP'!$C$71,'DRS-CAP'!$C$71,'DIA-CAP'!$C$71,'MSA-CAP'!$C$71))","v":19.217978687974494},207,148,620,185,{"$f":"IF(Einheiten!$D$18>=Grunddaten!J15,\"x\",\"\")","v":"x"},{"$f":"IF(Einheiten!$D$18<=Grunddaten!K15,\"x\",\"\")","v":""},-84.65,56.22,{"$f":"V15+W15*LOG(Einheiten!$D$18)","v":58.377505453372493},"x",{"$f":"IF(X15<=Specifications!$D$12,\"x\",\"\")","v":""},"x","","",{"$f":"IF(ROW(AC12)>COUNTA(AC:AC),\"\",INDEX(AC:AC,SMALL(IF(AC$1:AC$29<>\"\",ROW($1:$29)),ROW($AC12))))","v":{"$error":"#NUM!"}},""]
["DRS",180,"DRS180","DRS",null,null,{"$f":"Einheiten!$D$18","v":350},100,275,{"$f":"H16/Einheiten!$E$11","v":100},{"$f":"I16/Einheiten!$E$11","v":275},180,{"$f":"Dimensioning!$D$32/(PI()/4*(Grunddaten!L16/1000)^2*3600)","v":3.8205919123568846},{"$f":"SUM('DAL359-CAP'!$C$42,'DAL358-CAP'!$C$42,'DRS-CAP'!$C$42,'DIA-CAP'!$C$42,'MSA-CAP'!$C$42)*Grunddaten!G16^(SUM('DAL359-CAP'!$C$43,'DAL358-CAP'!$C$43,'DRS-CAP'!$C$43,'DIA-CAP'!$C$43,'MSA-CAP'!$C$43))","v":23.143459629611666},{"$f":"SUM('DAL359-CAP'!$C$70,'DAL358-CAP'!$C$70,'DRS-CAP'!$C$70,'DIA-CAP'!$C$70,'MSA-CAP'!$C$70)*Grunddaten!G16^(SUM('DAL359-CAP'!$C$71,'DAL358-CAP'!$C$71,'DRS-CAP'!$C$71,'DIA-CAP'!$C$71,'MSA-CAP'!$C$71))","v":19.217978687974494},252,231,620,280,{"$f":"IF(Einheiten!$D$18>=Grunddaten!J16,\"x\",\"\")","v":"x"},{"$f":"IF(Einheiten!$D$18<=Grunddaten!K16,\"x\",\"\")","v":""},-124.9,67.27,{"$f":"V16+W16*LOG(Einheiten!$D$18)","v":46.239457343443036},"x",{"$f":"IF(X16<=Specifications!$D$12,\"x\",\"\")","v":""},"x","","",{"$f":"IF(ROW(AC13)>COUNTA(AC:AC),\"\",INDEX(AC:AC,SMALL(IF(AC$1:AC$29<>\"\",ROW($1:$29)),ROW($AC13))))","v":{"$error":"#NUM!"}},""]
["DRS",250,"DRS250","DRS",null,null,{"$f":"Einheiten!$D$18","v":350},150,450,{"$f":"H17/Einheiten!$E$11","v":150},{"$f":"I17/Einheiten!$E$11","v":450},250,{"$f":"Dimensioning!$D$32/(PI()/4*(Grunddaten!L17/1000)^2*3600)","v":1.9805948473658088},{"$f":"SUM('DAL359-CAP'!$C$42,'DAL358-CAP'!$C$42,'DRS-CAP'!$C$42,'DIA-CAP'!$C$42,'MSA-CAP'!$C$42)*Grunddaten!G17^(SUM('DAL359-CAP'!$C$43,'DAL358-CAP'!$C$43,'DRS-CAP'!$C$43,'DIA-CAP'!$C$43,'MSA-CAP'!$C$43))","v":23.143459629611666},{"$f":"SUM('DAL359-CAP'!$C$70,'DAL358-CAP'!$C$70,'DRS-CAP'!$C$70,'DIA-CAP'!$C$70,'MSA-CAP'!$C$70)*Grunddaten!G17^(SUM('DAL359-CAP'!$C$71,'DAL358-CAP'!$C$71,'DRS-CAP'!$C$71,'DIA-CAP'!$C$71,'MSA-CAP'!$C$71))","v":19.217978687974494},302,316,620,380,{"$f":"IF(Einheiten!$D$18>=Grunddaten!J17,\"x\",\"\")","v":"x"},{"$f":"IF(Einheiten!$D$18<=Grunddaten!K17,\"x\",\"\")","v":"x"},-125,60.59,{"$f":"V17+W17*LOG(Einheiten!$D$18)","v":29.145082807183201},"x",{"$f":"IF(X17<=Specifications!$D$12,\"x\",\"\")","v":"x"},"x","x","DRS DN 250",{"$f":"IF(ROW(AC14)>COUNTA(AC:AC),\"\",INDEX(AC:AC,SMALL(IF(AC$1:AC$29<>\"\",ROW($1:$29)),ROW($AC14))))","v":{"$error":"#NUM!"}},""]
["DRS",315,"DRS315","DRS",null,null,{"$f":"Einheiten!$D$18","v":350},225,725,{"$f":"H18/Einheiten!$E$11","v":225},{"$f":"I18/Einheiten!$E$11","v":725},315,{"$f":"Dimensioning!$D$32/(PI()/4*(Grunddaten!L18/1000)^2*3600)","v":1.2475402162797988},{"$f":"SUM('DAL359-CAP'!$C$42,'DAL358-CAP'!$C$42,'DRS-CAP'!$C$42,'DIA-CAP'!$C$42,'MSA-CAP'!$C$42)*Grunddaten!G18^(SUM('DAL359-CAP'!$C$43,'DAL358-CAP'!$C$43,'DRS-CAP'!$C$43,'DIA-CAP'!$C$43,'MSA-CAP'!$C$43))","v":23.143459629611666},{"$f":"SUM('DAL359-CAP'!$C$70,'DAL358-CAP'!$C$70,'DRS-CAP'!$C$70,'DIA-CAP'!$C$70,'MSA-CAP'!$C$70)*Grunddaten!G18^(SUM('DAL359-CAP'!$C$71,'DAL358-CAP'!$C$71,'DRS-CAP'!$C$71,'DIA-CAP'!$C$71,'MSA-CAP'!$C$71))","v":19.217978687974494},367,405,620,490,{"$f":"IF(Einheiten!$D$18>=Grunddaten!J18,\"x\",\"\")","v":"x"},{"$f":"IF(Einheiten!$D$18<=Grunddaten!K18,\"x\",\"\")","v":"x"},-131.80000000000001,59.05,{"$f":"V18+W18*LOG(Einheiten!$D$18)","v":18.427218018883764},"x",{"$f":"IF(X18<=Specifications!$D$12,\"x\",\"\")","v":"x"},"x","x","DRS DN 315",{"$f":"IF(ROW(AC15)>COUNTA(AC:AC),\"\",INDEX(AC:AC,SMALL(IF(AC$1:AC$29<>\"\",ROW($1:$29)),ROW($AC15))))","v":{"$error":"#NUM!"}},""]
["DRS",355,"DRS355","DRS",null,null,{"$f":"Einheiten!$D$18","v":350},350,925,{"$f":"H19/Einheiten!$E$11","v":350},{"$f":"I19/Einheiten!$E$11","v":925},355,{"$f":"Dimensioning!$D$32/(PI()/4*(Grunddaten!L19/1000)^2*3600)","v":0.98224303083009756},{"$f":"SUM('DAL359-CAP'!$C$42,'DAL358-CAP'!$C$42,'DRS-CAP'!$C$42,'DIA-CAP'!$C$42,'MSA-CAP'!$C$42)*Grunddaten!G19^(SUM('DAL359-CAP'!$C$43,'DAL358-CAP'!$C$43,'DRS-CAP'!$C$43,'DIA-CAP'!$C$43,'MSA-CAP'!$C$43))","v":23.143459629611666},{"$f":"SUM('DAL359-CAP'!$C$70,'DAL358-CAP'!$C$70,'DRS-CAP'!$C$70,'DIA-CAP'!$C$70,'MSA-CAP'!$C$70)*Grunddaten!G19^(SUM('DAL359-CAP'!$C$71,'DAL358-CAP'!$C$71,'DRS-CAP'!$C$71,'DIA-CAP'!$C$71,'MSA-CAP'!$C$71))","v":19.217978687974494},402,453,620,550,{"$f":"IF(Einheiten!$D$18>=Grunddaten!J19,\"x\",\"\")","v":"x"},{"$f":"IF(Einheiten!$D$18<=Grunddaten!K19,\"x\",\"\")","v":"x"},-140,59.15,{"$f":"V19+W19*LOG(Einheiten!$D$18)","v":10.481624823318811},"x",{"$f":"IF(X19<=Specifications!$D$12,\"x\",\"\")","v":"x"},"x","x","DRS DN 355",{"$f":"IF(ROW(AC16)>COUNTA(AC:AC),\"\",INDEX(AC:AC,SMALL(IF(AC$1:AC$29<>\"\",ROW($1:$29)),ROW($AC16))))","v":{"$error":"#NUM!"}},""]
[null,100,"100",null,null,null,{"$f":"Einheiten!$D$18","v":350},25,100,{"$f":"H20/Einheiten!$E$11","v":25},{"$f":"I20/Einheiten!$E$11","v":100},100,{"$f":"Dimensioning!$D$32/(PI()/4*(Grunddaten!L20/1000)^2*3600)","v":12.378717796036304},{"$f":"(SUM('DAL359-CAP'!$C$42,'DAL358-CAP'!$C$42,'DRS-CAP'!$C$42,'DIA-CAP'!$C$42,'MSA-CAP'!$C$42)*Grunddaten!G20^(SUM('DAL359-CAP'!$C$43,'DAL358-CAP'!$C$43,'DRS-CAP'!$C$43,'DIA-CAP'!$C$43,'MSA-CAP'!$C$43)))*1.1","v":25.457805592572836},{"$f":"SUM('DAL359-CAP'!$C$70,'DAL358-CAP'!$C$70,'DRS-CAP'!$C$70,'DIA-CAP'!$C$70,'MSA-CAP'!$C$70)*Grunddaten!G20^(SUM('DAL359-CAP'!$C$71,'DAL358-CAP'!$C$71,'DRS-CAP'!$C$71,'DIA-CAP'!$C$71,'MSA-CAP'!$C$71))","v":19.217978687974494},177,122,620,155,{"$f":"IF(Einheiten!$D$18>=Grunddaten!J20,\"x\",\"\")","v":"x"},{"$f":"IF(Einheiten!$D$18<=Grunddaten!K20,\"x\",\"\")","v":""},-60.68,49.43,{"$f":"V20+W20*LOG(Einheiten!$D$18)","v":65.07328343223412},"x",{"$f":"IF(X20<=Specifications!$D$12,\"x\",\"\")","v":""},"gesperrt","","",{"$f":"IF(ROW(AC17)>COUNTA(AC:AC),\"\",INDEX(AC:AC,SMALL(IF(AC$1:AC$29<>\"\",ROW($1:$29)),ROW($AC17))))","v":{"$error":"#NUM!"}},""]
[null,125,"125",null,null,null,{"$f":"Einheiten!$D$18","v":350},50,150,{"$f":"H21/Einheiten!$E$11","v":50},{"$f":"I21/Einheiten!$E$11","v":150},125,{"$f":"Dimensioning!$D$32/(PI()/4*(Grunddaten!L21/1000)^2*3600)","v":7.9223793894632353},{"$f":"(SUM('DAL359-CAP'!$C$42,'DAL358-CAP'!$C$42,'DRS-CAP'!$C$42,'DIA-CAP'!$C$42,'MSA-CAP'!$C$42)*Grunddaten!G21^(SUM('DAL359-CAP'!$C$43,'DAL358-CAP'!$C$43,'DRS-CAP'!$C$43,'DIA-CAP'!$C$43,'MSA-CAP'!$C$43)))*1.1","v":25.457805592572836},{"$f":"SUM('DAL359-CAP'!$C$70,'DAL358-CAP'!$C$70,'DRS-CAP'!$C$70,'DIA-CAP'!$C$70,'MSA-CAP'!$C$70)*Grunddaten!G21^(SUM('DAL359-CAP'!$C$71,'DAL358-CAP'!$C$71,'DRS-CAP'!$C$71,'DIA-CAP'!$C$71,'MSA-CAP'!$C$71))","v":19.217978687974494},207,148,620,185,{"$f":"IF(Einheiten!$D$18>=Grunddaten!J21,\"x\",\"\")","v":"x"},{"$f":"IF(Einheiten!$D$18<=Grunddaten!K21,\"x\",\"\")","v":""},-82.15,56.22,{"$f":"V21+W21*LOG(Einheiten!$D$18)","v":60.877505453372493},"x",{"$f":"IF(X21<=Specifications!$D$12,\"x\",\"\")","v":""},"gesperrt","","",{"$f":"IF(ROW(AC18)>COUNTA(AC:AC),\"\",INDEX(AC:AC,SMALL(IF(AC$1:AC$29<>\"\",ROW($1:$29)),ROW($AC18))))","v":{"$error":"#NUM!"}},""]
[null,180,"180",null,null,null,{"$f":"Einheiten!$D$18","v":350},100,275,{"$f":"H22/Einheiten!$E$11","v":100},{"$f":"I22/Einheiten!$E$11","v":275},180,{"$f":"Dimensioning!$D$32/(PI()/4*(Grunddaten!L22/1000)^2*3600)","v":3.8205919123568846},{"$f":"(SUM('DAL359-CAP'!$C$42,'DAL358-CAP'!$C$42,'DRS-CAP'!$C$42,'DIA-CAP'!$C$42,'MSA-CAP'!$C$42)*Grunddaten!G22^(SUM('DAL359-CAP'!$C$43,'DAL358-CAP'!$C$43,'DRS-CAP'!$C$43,'DIA-CAP'!$C$43,'MSA-CAP'!$C$43)))*1.1","v":25.457805592572836},{"$f":"SUM('DAL359-CAP'!$C$70,'DAL358-CAP'!$C$70,'DRS-CAP'!$C$70,'DIA-CAP'!$C$70,'MSA-CAP'!$C$70)*Grunddaten!G22^(SUM('DAL359-CAP'!$C$71,'DAL358-CAP'!$C$71,'DRS-CAP'!$C$71,'DIA-CAP'!$C$71,'MSA-CAP'!$C$71))","v":19.217978687974494},252,231,620,280,{"$f":"IF(Einheiten!$D$18>=Grunddaten!J22,\"x\",\"\")","v":"x"},{"$f":"IF(Einheiten!$D$18<=Grunddaten!K22,\"x\",\"\")","v":""},-122.4,67.27,{"$f":"V22+W22*LOG(Einheiten!$D$18)","v":48.739457343443036},"x",{"$f":"IF(X22<=Specifications!$D$12,\"x\",\"\")","v":""},"gesperrt","","",{"$f":"IF(ROW(AC19)>COUNTA(AC:AC),\"\",INDEX(AC:AC,SMALL(IF(AC$1:AC$29<>\"\",ROW($1:$29)),ROW($AC19))))","v":{"$error":"#NUM!"}},""]
[null,250,"250",null,null,null,{"$f":"Einheiten!$D$18","v":350},150,450,{"$f":"H23/Einheiten!$E$11","v":150},{"$f":"I23/Einheiten!$E$11","v":450},250,{"$f":"Dimensioning!$D$32/(PI()/4*(Grunddaten!L23/1000)^2*3600)","v":1.9805948473658088},{"$f":"(SUM('DAL359-CAP'!$C$42,'DAL358-CAP'!$C$42,'DRS-CAP'!$C$42,'DIA-CAP'!$C$42,'MSA-CAP'!$C$42)*Grunddaten!G23^(SUM('DAL359-CAP'!$C$43,'DAL358-CAP'!$C$43,'DRS-CAP'!$C$43,'DIA-CAP'!$C$43,'MSA-CAP'!$C$43)))*1.1","v":25.457805592572836},{"$f":"SUM('DAL359-CAP'!$C$70,'DAL358-CAP'!$C$70,'DRS-CAP'!$C$70,'DIA-CAP'!$C$70,'MSA-CAP'!$C$70)*Grunddaten!G23^(SUM('DAL359-CAP'!$C$71,'DAL358-CAP'!$C$71,'DRS-CAP'!$C$71,'DIA-CAP'!$C$71,'MSA-CAP'!$C$71))","v":19.217978687974494},302,316,620,380,{"$f":"IF(Einheiten!$D$18>=Grunddaten!J23,\"x\",\"\")","v":"x"},{"$f":"IF(Einheiten!$D$18<=Grunddaten!K23,\"x\",\"\")","v":"x"},-122.5,60.59,{"$f":"V23+W23*LOG(Einheiten!$D$18)","v":31.645082807183201},"x",{"$f":"IF(X23<=Specifications!$D$12,\"x\",\"\")","v":"x"},"gesperrt","","",{"$f":"IF(ROW(AC20)>COUNTA(AC:AC),\"\",INDEX(AC:AC,SMALL(IF(AC$1:AC$29<>\"\",ROW($1:$29)),ROW($AC20))))","v":{"$error":"#NUM!"}},""]
[null,315,"315",null,null,null,{"$f":"Einheiten!$D$18","v":350},225,725,{"$f":"H24/Einheiten!$E$11","v":225},{"$f":"I24/Einheiten!$E$11","v":725},315,{"$f":"Dimensioning!$D$32/(PI()/4*(Grunddaten!L24/1000)^2*3600)","v":1.2475402162797988},{"$f":"(SUM('DAL359-CAP'!$C$42,'DAL358-CAP'!$C$42,'DRS-CAP'!$C$42,'DIA-CAP'!$C$42,'MSA-CAP'!$C$42)*Grunddaten!G24^(SUM('DAL359-CAP'!$C$43,'DAL358-CAP'!$C$43,'DRS-CAP'!$C$43,'DIA-CAP'!$C$43,'MSA-CAP'!$C$43)))*1.1","v":25.457805592572836},{"$f":"SUM('DAL359-CAP'!$C$70,'DAL358-CAP'!$C$70,'DRS-CAP'!$C$70,'DIA-CAP'!$C$70,'MSA-CAP'!$C$70)*Grunddaten!G24^(SUM('DAL359-CAP'!$C$71,'DAL358-CAP'!$C$71,'DRS-CAP'!$C$71,'DIA-CAP'!$C$71,'MSA-CAP'!$C$71))","v":19.217978687974494},367,405,620,490,{"$f":"IF(Einheiten!$D$18>=Grunddaten!J24,\"x\",\"\")","v":"x"},{"$f":"IF(Einheiten!$D$18<=Grunddaten!K24,\"x\",\"\")","v":"x"},-129.30000000000001,59.05,{"$f":"V24+W24*LOG(Einheiten!$D$18)","v":20.927218018883764},"x",{"$f":"IF(X24<=Specifications!$D$12,\"x\",\"\")","v":"x"},"gesperrt","","",{"$f":"IF(ROW(AC21)>COUNTA(AC:AC),\"\",INDEX(AC:AC,SMALL(IF(AC$1:AC$29<>\"\",ROW($1:$29)),ROW($AC21))))","v":{"$error":"#NUM!"}},""]
[null,355,"355",null,null,null,{"$f":"Einheiten!$D$18","v":350},350,950,{"$f":"H25/Einheiten!$E$11","v":350},{"$f":"I25/Einheiten!$E$11","v":950},355,{"$f":"Dimensioning!$D$32/(PI()/4*(Grunddaten!L25/1000)^2*3600)","v":0.98224303083009756},{"$f":"(SUM('DAL359-CAP'!$C$42,'DAL358-CAP'!$C$42,'DRS-CAP'!$C$42,'DIA-CAP'!$C$42,'MSA-CAP'!$C$42)*Grunddaten!G25^(SUM('DAL359-CAP'!$C$43,'DAL358-CAP'!$C$43,'DRS-CAP'!$C$43,'DIA-CAP'!$C$43,'MSA-CAP'!$C$43)))*1.1","v":25.457805592572836},{"$f":"SUM('DAL359-CAP'!$C$70,'DAL358-CAP'!$C$70,'DRS-CAP'!$C$70,'DIA-CAP'!$C$70,'MSA-CAP'!$C$70)*Grunddaten!G25^(SUM('DAL359-CAP'!$C$71,'DAL358-CAP'!$C$71,'DRS-CAP'!$C$71,'DIA-CAP'!$C$71,'MSA-CAP'!$C$71))","v":19.217978687974494},402,453,620,550,{"$f":"IF(Einheiten!$D$18>=Grunddaten!J25,\"x\",\"\")","v":"x"},{"$f":"IF(Einheiten!$D$18<=Grunddaten!K25,\"x\",\"\")","v":"x"},-137.5,59.15,{"$f":"V25+W25*LOG(Einheiten!$D$18)","v":12.981624823318811},"x",{"$f":"IF(X25<=Specifications!$D$12,\"x\",\"\")","v":"x"},"gesperrt","","",{"$f":"IF(ROW(AC22)>COUNTA(AC:AC),\"\",INDEX(AC:AC,SMALL(IF(AC$1:AC$29<>\"\",ROW($1:$29)),ROW($AC22))))","v":{"$error":"#NUM!"}},""]
["MSA",300,"MSA300","MSA",null,null,{"$f":"Einheiten!$D$18","v":350},75,600,{"$f":"H26/Einheiten!$E$11","v":75},{"$f":"I26/Einheiten!$E$11","v":600},160,{"$f":"Dimensioning!$D$32/(PI()/4*(Grunddaten!L26/1000)^2*3600)","v":4.835436639076681},{"$f":"SUM('DAL359-CAP'!$C$42,'DAL358-CAP'!$C$42,'DRS-CAP'!$C$42,'DIA-CAP'!$C$42,'MSA-CAP'!$C$42)*Grunddaten!G26^(SUM('DAL359-CAP'!$C$43,'DAL358-CAP'!$C$43,'DRS-CAP'!$C$43,'DIA-CAP'!$C$43,'MSA-CAP'!$C$43))","v":23.143459629611666},{"$f":"SUM('DAL359-CAP'!$C$70,'DAL358-CAP'!$C$70,'DRS-CAP'!$C$70,'DIA-CAP'!$C$70,'MSA-CAP'!$C$70)*Grunddaten!G26^(SUM('DAL359-CAP'!$C$71,'DAL358-CAP'!$C$71,'DRS-CAP'!$C$71,'DIA-CAP'!$C$71,'MSA-CAP'!$C$71))","v":19.217978687974494},275,292,298,{"$f":"\"-/-\"","v":"-/-"},{"$f":"IF(Einheiten!$D$18>=Grunddaten!J26,\"x\",\"\")","v":"x"},{"$f":"IF(Einheiten!$D$18<=Grunddaten!K26,\"x\",\"\")","v":"x"},-102.89108412925144,60.560770981134887,{"$f":"V26+W26*LOG(Einheiten!$D$18)","v":51.179638065069312},"x",{"$f":"IF(X26<=Specifications!$D$12,\"x\",\"\")","v":""},"x","","",{"$f":"IF(ROW(AC23)>COUNTA(AC:AC),\"\",INDEX(AC:AC,SMALL(IF(AC$1:AC$29<>\"\",ROW($1:$29)),ROW($AC23))))","v":{"$error":"#NUM!"}},""]
["MSA",400,"MSA400","MSA",null,null,{"$f":"Einheiten!$D$18","v":350},130,700,{"$f":"H27/Einheiten!$E$11","v":130},{"$f":"I27/Einheiten!$E$11","v":700},200,{"$f":"Dimensioning!$D$32/(PI()/4*(Grunddaten!L27/1000)^2*3600)","v":3.0946794490090759},{"$f":"SUM('DAL359-CAP'!$C$42,'DAL358-CAP'!$C$42,'DRS-CAP'!$C$42,'DIA-CAP'!$C$42,'MSA-CAP'!$C$42)*Grunddaten!G27^(SUM('DAL359-CAP'!$C$43,'DAL358-CAP'!$C$43,'DRS-CAP'!$C$43,'DIA-CAP'!$C$43,'MSA-CAP'!$C$43))","v":23.143459629611666},{"$f":"SUM('DAL359-CAP'!$C$70,'DAL358-CAP'!$C$70,'DRS-CAP'!$C$70,'DIA-CAP'!$C$70,'MSA-CAP'!$C$70)*Grunddaten!G27^(SUM('DAL359-CAP'!$C$71,'DAL358-CAP'!$C$71,'DRS-CAP'!$C$71,'DIA-CAP'!$C$71,'MSA-CAP'!$C$71))","v":19.217978687974494},315,392,398,{"$f":"\"-/-\"","v":"-/-"},{"$f":"IF(Einheiten!$D$18>=Grunddaten!J27,\"x\",\"\")","v":"x"},{"$f":"IF(Einheiten!$D$18<=Grunddaten!K27,\"x\",\"\")","v":"x"},-124.04972114709894,65.35058245929325,{"$f":"V27+W27*LOG(Einheiten!$D$18)","v":42.20660736726667},"x",{"$f":"IF(X27<=Specifications!$D$12,\"x\",\"\")","v":""},"x","","",{"$f":"IF(ROW(AC24)>COUNTA(AC:AC),\"\",INDEX(AC:AC,SMALL(IF(AC$1:AC$29<>\"\",ROW($1:$29)),ROW($AC24))))","v":{"$error":"#NUM!"}},""]
["MSA",500,"MSA500","MSA",null,null,{"$f":"Einheiten!$D$18","v":350},200,800,{"$f":"H28/Einheiten!$E$11","v":200},{"$f":"I28/Einheiten!$E$11","v":800},225,{"$f":"Dimensioning!$D$32/(PI()/4*(Grunddaten!L28/1000)^2*3600)","v":2.4451788239084054},{"$f":"SUM('DAL359-CAP'!$C$42,'DAL358-CAP'!$C$42,'DRS-CAP'!$C$42,'DIA-CAP'!$C$42,'MSA-CAP'!$C$42)*Grunddaten!G28^(SUM('DAL359-CAP'!$C$43,'DAL358-CAP'!$C$43,'DRS-CAP'!$C$43,'DIA-CAP'!$C$43,'MSA-CAP'!$C$43))","v":23.143459629611666},{"$f":"SUM('DAL359-CAP'!$C$70,'DAL358-CAP'!$C$70,'DRS-CAP'!$C$70,'DIA-CAP'!$C$70,'MSA-CAP'!$C$70)*Grunddaten!G28^(SUM('DAL359-CAP'!$C$71,'DAL358-CAP'!$C$71,'DRS-CAP'!$C$71,'DIA-CAP'!$C$71,'MSA-CAP'!$C$71))","v":19.217978687974494},340,492,498,"-/-",{"$f":"IF(Einheiten!$D$18>=Grunddaten!J28,\"x\",\"\")","v":"x"},{"$f":"IF(Einheiten!$D$18<=Grunddaten!K28,\"x\",\"\")","v":"x"},-116.91527170898351,56.589666454135127,{"$f":"V28+W28*LOG(Einheiten!$D$18)","v":27.052690357422449},"x",{"$f":"IF(X28<=Specifications!$D$12,\"x\",\"\")","v":"x"},"x","x","MSA DN 500",{"$f":"IF(ROW(AC25)>COUNTA(AC:AC),\"\",INDEX(AC:AC,SMALL(IF(AC$1:AC$29<>\"\",ROW($1:$29)),ROW($AC25))))","v":{"$error":"#NUM!"}},""]
["MSA",600,"MSA600","MSA",null,null,{"$f":"Einheiten!$D$18","v":350},300,1000,{"$f":"H29/Einheiten!$E$11","v":300},{"$f":"I29/Einheiten!$E$11","v":1000},250,{"$f":"Dimensioning!$D$32/(PI()/4*(Grunddaten!L29/1000)^2*3600)","v":1.9805948473658088},{"$f":"SUM('DAL359-CAP'!$C$42,'DAL358-CAP'!$C$42,'DRS-CAP'!$C$42,'DIA-CAP'!$C$42,'MSA-CAP'!$C$42)*Grunddaten!G29^(SUM('DAL359-CAP'!$C$43,'DAL358-CAP'!$C$43,'DRS-CAP'!$C$43,'DIA-CAP'!$C$43,'MSA-CAP'!$C$43))","v":23.143459629611666},{"$f":"SUM('DAL359-CAP'!$C$70,'DAL358-CAP'!$C$70,'DRS-CAP'!$C$70,'DIA-CAP'!$C$70,'MSA-CAP'!$C$70)*Grunddaten!G29^(SUM('DAL359-CAP'!$C$71,'DAL358-CAP'!$C$71,'DRS-CAP'!$C$71,'DIA-CAP'!$C$71,'MSA-CAP'!$C$71))","v":19.217978687974494},365,614,595,"-/-",{"$f":"IF(Einheiten!$D$18>=Grunddaten!J29,\"x\",\"\")","v":"x"},{"$f":"IF(Einheiten!$D$18<=Grunddaten!K29,\"x\",\"\")","v":"x"},-140.78516782633633,62.432981117219406,{"$f":"V29+W29*LOG(Einheiten!$D$18)","v":18.048584347505738},"x",{"$f":"IF(X29<=Specifications!$D$12,\"x\",\"\")","v":"x"},"x","x","MSA DN 600",{"$f":"IF(ROW(AC26)>COUNTA(AC:AC),\"\",INDEX(AC:AC,SMALL(IF(AC$1:AC$29<>\"\",ROW($1:$29)),ROW($AC26))))","v":{"$error":"#NUM!"}},""]
[null,null,null,null,null,null,null,null,null,null,null,null,null,null,null,null,null,null,null,null,null,null,null,null,null,null,null,null,null,{"$f":"IF(ROW(AC27)>COUNTA(AC:AC),\"\",INDEX(AC:AC,SMALL(IF(AC$1:AC$29<>\"\",ROW($1:$29)),ROW($AC27))))","v":""}]
[null,null,null,2,3,4,5,6,7,8,9,10,11,12,13,14,15,16,17,18,17,18,19,20,null,21,null,22,null,{"$f":"IF(ROW(AC28)>COUNTA(AC:AC),\"\",INDEX(AC:AC,SMALL(IF(AC$1:AC$29<>\"\",ROW($1:$29)),ROW($AC28))))","v":""}]
[null,null,null,null,null,null,null,null,null,null,null,null,null,null,null,null,null,null,null,null,null,null,null,null,null,null,null,null,null,"Formel in Spalte AB ist Matrixformel!"]
["Auswahl:","Zuluft",{"$f":"CONCATENATE(Dimensioning!$D$12,Dimensioning!$D$25)","v":"DAL 358500"},{"$f":"VLOOKUP($C$33,$C$4:$N$30,D31,FALSE)","v":"DAL 358"},0,0,350,200,800,{"$f":"VLOOKUP($C$33,$C$4:$N$30,J31,FALSE)","v":200},800,{"$f":"VLOOKUP($C$33,$C$4:$N$30,L31,FALSE)","v":225},2.4451788239084054,{"$f":"VLOOKUP($C$33,$C$4:$N$30,N31,FALSE)","v":23.143459629611666},{"$f":"VLOOKUP($C$33,$C$4:$O$30,O31,FALSE)","v":19.217978687974494},{"$f":"VLOOKUP($C$33,$C$4:$P$30,P31,FALSE)","v":340},{"$f":"VLOOKUP($C$33,$C$4:$S$30,Q31,FALSE)","v":492},{"$f":"VLOOKUP($C$33,$C$4:$S$30,R31,FALSE)","v":498},{"$f":"VLOOKUP($C$33,$C$4:$S$30,S31,FALSE)","v":500},{"$f":"VLOOKUP($C$33,$C$4:$T$30,T31,FALSE)","v":"x"},{"$f":"VLOOKUP($C$33,$C$4:$AB$30,U31,FALSE)","v":500},{"$f":"VLOOKUP($C$33,$C$4:$AB$30,V31,FALSE)","v":"x"},{"$f":"VLOOKUP($C$33,$C$4:$AB$30,W31,FALSE)","v":"x"},{"$f":"VLOOKUP($C$33,$C$4:$AB$30,X31,FALSE)","v":-124.54},null,{"$f":"VLOOKUP($C$33,$C$4:$AB$30,Z31,FALSE)","v":62.47},null,{"$f":"VLOOKUP($C$33,$C$4:$AB$30,AB31,FALSE)","v":34.387930730561706},null,"Funktioniert nur bei Bestätigung"]
[null,"Abluft",{"$f":"CONCATENATE(Dimensioning!$D$12,Dimensioning!$D$25)","v":"DAL 358500"},{"$f":"VLOOKUP($C$34,$C$4:$N$30,D31,FALSE)","v":"DAL 358"},0,0,350,200,800,{"$f":"VLOOKUP($C$34,$C$4:$N$30,J31,FALSE)","v":200},800,225,2.4451788239084054,{"$f":"VLOOKUP($C$34,$C$4:$N$30,N31,FALSE)","v":23.143459629611666},{"$f":"VLOOKUP($C$33,$C$4:$O$30,O31,FALSE)","v":19.217978687974494},{"$f":"VLOOKUP($C$34,$C$4:$P$30,P31,FALSE)","v":340},{"$f":"VLOOKUP($C$34,$C$4:$S$30,Q31,FALSE)","v":492},{"$f":"VLOOKUP($C$34,$C$4:$S$30,R31,FALSE)","v":498},{"$f":"VLOOKUP($C$34,$C$4:$S$30,S31,FALSE)","v":500},{"$f":"VLOOKUP($C$34,$C$4:$T$30,T31,FALSE)","v":"x"},null,null,null,null,null,null,null,null,null,"mit Strg+Shift+Enter!"]
[]
[null,null,null,"Stand:","2017-05-31",null,null,null,null,null,null,null,null,null,null,"Abmessungen DRS und DIA mit AK-rund aus CAP!"]
[]
[]
["Blendengröße",null,300,400,500,600,625,800]
["mögl. Lochbild",null,100,100,100,100,100,100]
[null,null,125,125,125,125,125,125]
[null,null,180,180,180,180,180,180]
[null,null,null,250,250,250,250,250]
[null,null,null,null,315,315,315,315]
[null,null,null,null,null,355,355,355]
[]
["Blendengröße",null,300,400,500,600,625,800]
[null,null,300,300,300,300,300,300]
[null,null,null,400,400,400,400,400]
[null,null,null,null,500,500,500,500]
[null,null,null,null,null,600,600,600]
[null,null,null,null,null,null,null,800]

{"sheet":"Lw","index":8,"n_rows":149,"n_cols":23,"rows_kept":149,"cut":false,"hidden":true,"merged":[[54,1,54,7],[1,1,1,21],[21,1,21,21],[123,0,123,2],[124,0,124,1],[3,0,18,0],[93,1,93,7]]}
[]
[null,"Terzfrequenzband fm [Hz]"]
[null,100,125,160,200,250,315,400,500,630,800,1000,1250,1600,2000,2500,3150,4000,5000,6300,8000,10000]
["Konstantensätze bei Bedarf aktualisieren und Vergleich der unterschiedlichen Berechnungsarten anstellen! Klassische CAP-Berechnung wird unten durchgeführt."]
[]
[]
[]
[]
[]
[]
[]
[]
[]
[]
[]
[]
[]
[]
[]
[null,2,3,4,5,6,7,8,9,10,11,12,13,14,15,16,17,18,19,20,21,22]
[]
[null,"Terzfrequenzband fm [Hz]"]
[null,100,125,160,200,250,315,400,500,630,800,1000,1250,1600,2000,2500,3150,4000,5000,6300,8000,10000]
[{"$f":"Grunddaten!C4","v":"DAL 359300"},{"$f":"B$4+Lw!B$5*LOG(Grunddaten!$G4)+B$6*LOG(Grunddaten!$F4)+B$7*LOG(Grunddaten!$H4)","v":{"$error":"#NUM!"}},{"$f":"C$4+C$5*LOG(Grunddaten!$G4)+C$6*LOG(Grunddaten!$F4)+C$7*LOG(Grunddaten!$H4)","v":{"$error":"#NUM!"}},{"$f":"D$4+D$5*LOG(Grunddaten!$G4)+D$6*LOG(Grunddaten!$F4)+D$7*LOG(Grunddaten!$H4)","v":{"$error":"#NUM!"}},{"$f":"E$4+E$5*LOG(Grunddaten!$G4)+E$6*LOG(Grunddaten!$F4)+E$7*LOG(Grunddaten!$H4)","v":{"$error":"#NUM!"}},{"$f":"F$4+F$5*LOG(Grunddaten!$G4)+F$6*LOG(Grunddaten!$F4)+F$7*LOG(Grunddaten!$H4)","v":{"$error":"#NUM!"}},{"$f":"G$4+G$5*LOG(Grunddaten!$G4)+G$6*LOG(Grunddaten!$F4)+G$7*LOG(Grunddaten!$H4)","v":{"$error":"#NUM!"}},{"$f":"H$4+H$5*LOG(Grunddaten!$G4)+H$6*LOG(Grunddaten!$F4)+H$7*LOG(Grunddaten!$H4)","v":{"$error":"#NUM!"}},{"$f":"I$4+I$5*LOG(Grunddaten!$G4)+I$6*LOG(Grunddaten!$F4)+I$7*LOG(Grunddaten!$H4)","v":{"$error":"#NUM!"}},{"$f":"J$4+J$5*LOG(Grunddaten!$G4)+J$6*LOG(Grunddaten!$F4)+J$7*LOG(Grunddaten!$H4)","v":{"$error":"#NUM!"}},{"$f":"K$4+K$5*LOG(Grunddaten!$G4)+K$6*LOG(Grunddaten!$F4)+K$7*LOG(Grunddaten!$H4)","v":{"$error":"#NUM!"}},{"$f":"L$4+L$5*LOG(Grunddaten!$G4)+L$6*LOG(Grunddaten!$F4)+L$7*LOG(Grunddaten!$H4)","v":{"$error":"#NUM!"}},{"$f":"M$4+M$5*LOG(Grunddaten!$G4)+M$6*LOG(Grunddaten!$F4)+M$7*LOG(Grunddaten!$H4)","v":{"$error":"#NUM!"}},{"$f":"N$4+N$5*LOG(Grunddaten!$G4)+N$6*LOG(Grunddaten!$F4)+N$7*LOG(Grunddaten!$H4)","v":{"$error":"#NUM!"}},{"$f":"O$4+O$5*LOG(Grunddaten!$G4)+O$6*LOG(Grunddaten!$F4)+O$7*LOG(Grunddaten!$H4)","v":{"$error":"#NUM!"}},{"$f":"P$4+P$5*LOG(Grunddaten!$G4)+P$6*LOG(Grunddaten!$F4)+P$7*LOG(Grunddaten!$H4)","v":{"$error":"#NUM!"}},{"$f":"Q$4+Q$5*LOG(Grunddaten!$G4)+Q$6*LOG(Grunddaten!$F4)+Q$7*LOG(Grunddaten!$H4)","v":{"$error":"#NUM!"}},{"$f":"R$4+R$5*LOG(Grunddaten!$G4)+R$6*LOG(Grunddaten!$F4)+R$7*LOG(Grunddaten!$H4)","v":{"$error":"#NUM!"}},{"$f":"S$4+S$5*LOG(Grunddaten!$G4)+S$6*LOG(Grunddaten!$F4)+S$7*LOG(Grunddaten!$H4)","v":{"$error":"#NUM!"}},{"$f":"T$4+T$5*LOG(Grunddaten!$G4)+T$6*LOG(Grunddaten!$F4)+T$7*LOG(Grunddaten!$H4)","v":{"$error":"#NUM!"}},{"$f":"U$4+U$5*LOG(Grunddaten!$G4)+U$6*LOG(Grunddaten!$F4)+U$7*LOG(Grunddaten!$H4)","v":{"$error":"#NUM!"}},{"$f":"V$4+V$5*LOG(Grunddaten!$G4)+V$6*LOG(Grunddaten!$F4)+V$7*LOG(Grunddaten!$H4)","v":{"$error":"#NUM!"}},{"$f":"10*LOG(10^(0.1*B24)+10^(0.1*C24)+10^(0.1*D24)+10^(0.1*E24)+10^(0.1*F24)+10^(0.1*G24)+10^(0.1*H24)+10^(0.1*I24)+10^(0.1*J24)+10^(0.1*K24)+10^(0.1*L24)+10^(0.1*M24)+10^(0.1*N24)+10^(0.1*O24)+10^(0.1*P24)+10^(0.1*Q24)+10^(0.1*R24)+10^(0.1*S24)+10^(0.1*T24)+10^(0.1*U24)+10^(0.1*V24))","v":{"$error":"#NUM!"}}]
[{"$f":"Grunddaten!C5","v":"DAL 359400"},{"$f":"B$4+B$5*LOG(Grunddaten!$G5)+B$6*LOG(Grunddaten!$F5)+B$7*LOG(Grunddaten!$H5)","v":{"$error":"#NUM!"}},{"$f":"C$4+C$5*LOG(Grunddaten!$G5)+C$6*LOG(Grunddaten!$F5)+C$7*LOG(Grunddaten!$H5)","v":{"$error":"#NUM!"}},{"$f":"D$4+D$5*LOG(Grunddaten!$G5)+D$6*LOG(Grunddaten!$F5)+D$7*LOG(Grunddaten!$H5)","v":{"$error":"#NUM!"}},{"$f":"E$4+E$5*LOG(Grunddaten!$G5)+E$6*LOG(Grunddaten!$F5)+E$7*LOG(Grunddaten!$H5)","v":{"$error":"#NUM!"}},{"$f":"F$4+F$5*LOG(Grunddaten!$G5)+F$6*LOG(Grunddaten!$F5)+F$7*LOG(Grunddaten!$H5)","v":{"$error":"#NUM!"}},{"$f":"G$4+G$5*LOG(Grunddaten!$G5)+G$6*LOG(Grunddaten!$F5)+G$7*LOG(Grunddaten!$H5)","v":{"$error":"#NUM!"}},{"$f":"H$4+H$5*LOG(Grunddaten!$G5)+H$6*LOG(Grunddaten!$F5)+H$7*LOG(Grunddaten!$H5)","v":{"$error":"#NUM!"}},{"$f":"I$4+I$5*LOG(Grunddaten!$G5)+I$6*LOG(Grunddaten!$F5)+I$7*LOG(Grunddaten!$H5)","v":{"$error":"#NUM!"}},{"$f":"J$4+J$5*LOG(Grunddaten!$G5)+J$6*LOG(Grunddaten!$F5)+J$7*LOG(Grunddaten!$H5)","v":{"$error":"#NUM!"}},{"$f":"K$4+K$5*LOG(Grunddaten!$G5)+K$6*LOG(Grunddaten!$F5)+K$7*LOG(Grunddaten!$H5)","v":{"$error":"#NUM!"}},{"$f":"L$4+L$5*LOG(Grunddaten!$G5)+L$6*LOG(Grunddaten!$F5)+L$7*LOG(Grunddaten!$H5)","v":{"$error":"#NUM!"}},{"$f":"M$4+M$5*LOG(Grunddaten!$G5)+M$6*LOG(Grunddaten!$F5)+M$7*LOG(Grunddaten!$H5)","v":{"$error":"#NUM!"}},{"$f":"N$4+N$5*LOG(Grunddaten!$G5)+N$6*LOG(Grunddaten!$F5)+N$7*LOG(Grunddaten!$H5)","v":{"$error":"#NUM!"}},{"$f":"O$4+O$5*LOG(Grunddaten!$G5)+O$6*LOG(Grunddaten!$F5)+O$7*LOG(Grunddaten!$H5)","v":{"$error":"#NUM!"}},{"$f":"P$4+P$5*LOG(Grunddaten!$G5)+P$6*LOG(Grunddaten!$F5)+P$7*LOG(Grunddaten!$H5)","v":{"$error":"#NUM!"}},{"$f":"Q$4+Q$5*LOG(Grunddaten!$G5)+Q$6*LOG(Grunddaten!$F5)+Q$7*LOG(Grunddaten!$H5)","v":{"$error":"#NUM!"}},{"$f":"R$4+R$5*LOG(Grunddaten!$G5)+R$6*LOG(Grunddaten!$F5)+R$7*LOG(Grunddaten!$H5)","v":{"$error":"#NUM!"}},{"$f":"S$4+S$5*LOG(Grunddaten!$G5)+S$6*LOG(Grunddaten!$F5)+S$7*LOG(Grunddaten!$H5)","v":{"$error":"#NUM!"}},{"$f":"T$4+T$5*LOG(Grunddaten!$G5)+T$6*LOG(Grunddaten!$F5)+T$7*LOG(Grunddaten!$H5)","v":{"$error":"#NUM!"}},{"$f":"U$4+U$5*LOG(Grunddaten!$G5)+U$6*LOG(Grunddaten!$F5)+U$7*LOG(Grunddaten!$H5)","v":{"$error":"#NUM!"}},{"$f":"V$4+V$5*LOG(Grunddaten!$G5)+V$6*LOG(Grunddaten!$F5)+V$7*LOG(Grunddaten!$H5)","v":{"$error":"#NUM!"}},{"$f":"10*LOG(10^(0.1*B25)+10^(0.1*C25)+10^(0.1*D25)+10^(0.1*E25)+10^(0.1*F25)+10^(0.1*G25)+10^(0.1*H25)+10^(0.1*I25)+10^(0.1*J25)+10^(0.1*K25)+10^(0.1*L25)+10^(0.1*M25)+10^(0.1*N25)+10^(0.1*O25)+10^(0.1*P25)+10^(0.1*Q25)+10^(0.1*R25)+10^(0.1*S25)+10^(0.1*T25)+10^(0.1*U25)+10^(0.1*V25))","v":{"$error":"#NUM!"}}]
[{"$f":"Grunddaten!C6","v":"DAL 359500"},{"$f":"B$4+B$5*LOG(Grunddaten!$G6)+B$6*LOG(Grunddaten!$F6)+B$7*LOG(Grunddaten!$H6)","v":{"$error":"#NUM!"}},{"$f":"C$4+C$5*LOG(Grunddaten!$G6)+C$6*LOG(Grunddaten!$F6)+C$7*LOG(Grunddaten!$H6)","v":{"$error":"#NUM!"}},{"$f":"D$4+D$5*LOG(Grunddaten!$G6)+D$6*LOG(Grunddaten!$F6)+D$7*LOG(Grunddaten!$H6)","v":{"$error":"#NUM!"}},{"$f":"E$4+E$5*LOG(Grunddaten!$G6)+E$6*LOG(Grunddaten!$F6)+E$7*LOG(Grunddaten!$H6)","v":{"$error":"#NUM!"}},{"$f":"F$4+F$5*LOG(Grunddaten!$G6)+F$6*LOG(Grunddaten!$F6)+F$7*LOG(Grunddaten!$H6)","v":{"$error":"#NUM!"}},{"$f":"G$4+G$5*LOG(Grunddaten!$G6)+G$6*LOG(Grunddaten!$F6)+G$7*LOG(Grunddaten!$H6)","v":{"$error":"#NUM!"}},{"$f":"H$4+H$5*LOG(Grunddaten!$G6)+H$6*LOG(Grunddaten!$F6)+H$7*LOG(Grunddaten!$H6)","v":{"$error":"#NUM!"}},{"$f":"I$4+I$5*LOG(Grunddaten!$G6)+I$6*LOG(Grunddaten!$F6)+I$7*LOG(Grunddaten!$H6)","v":{"$error":"#NUM!"}},{"$f":"J$4+J$5*LOG(Grunddaten!$G6)+J$6*LOG(Grunddaten!$F6)+J$7*LOG(Grunddaten!$H6)","v":{"$error":"#NUM!"}},{"$f":"K$4+K$5*LOG(Grunddaten!$G6)+K$6*LOG(Grunddaten!$F6)+K$7*LOG(Grunddaten!$H6)","v":{"$error":"#NUM!"}},{"$f":"L$4+L$5*LOG(Grunddaten!$G6)+L$6*LOG(Grunddaten!$F6)+L$7*LOG(Grunddaten!$H6)","v":{"$error":"#NUM!"}},{"$f":"M$4+M$5*LOG(Grunddaten!$G6)+M$6*LOG(Grunddaten!$F6)+M$7*LOG(Grunddaten!$H6)","v":{"$error":"#NUM!"}},{"$f":"N$4+N$5*LOG(Grunddaten!$G6)+N$6*LOG(Grunddaten!$F6)+N$7*LOG(Grunddaten!$H6)","v":{"$error":"#NUM!"}},{"$f":"O$4+O$5*LOG(Grunddaten!$G6)+O$6*LOG(Grunddaten!$F6)+O$7*LOG(Grunddaten!$H6)","v":{"$error":"#NUM!"}},{"$f":"P$4+P$5*LOG(Grunddaten!$G6)+P$6*LOG(Grunddaten!$F6)+P$7*LOG(Grunddaten!$H6)","v":{"$error":"#NUM!"}},{"$f":"Q$4+Q$5*LOG(Grunddaten!$G6)+Q$6*LOG(Grunddaten!$F6)+Q$7*LOG(Grunddaten!$H6)","v":{"$error":"#NUM!"}},{"$f":"R$4+R$5*LOG(Grunddaten!$G6)+R$6*LOG(Grunddaten!$F6)+R$7*LOG(Grunddaten!$H6)","v":{"$error":"#NUM!"}},{"$f":"S$4+S$5*LOG(Grunddaten!$G6)+S$6*LOG(Grunddaten!$F6)+S$7*LOG(Grunddaten!$H6)","v":{"$error":"#NUM!"}},{"$f":"T$4+T$5*LOG(Grunddaten!$G6)+T$6*LOG(Grunddaten!$F6)+T$7*LOG(Grunddaten!$H6)","v":{"$error":"#NUM!"}},{"$f":"U$4+U$5*LOG(Grunddaten!$G6)+U$6*LOG(Grunddaten!$F6)+U$7*LOG(Grunddaten!$H6)","v":{"$error":"#NUM!"}},{"$f":"V$4+V$5*LOG(Grunddaten!$G6)+V$6*LOG(Grunddaten!$F6)+V$7*LOG(Grunddaten!$H6)","v":{"$error":"#NUM!"}},{"$f":"10*LOG(10^(0.1*B26)+10^(0.1*C26)+10^(0.1*D26)+10^(0.1*E26)+10^(0.1*F26)+10^(0.1*G26)+10^(0.1*H26)+10^(0.1*I26)+10^(0.1*J26)+10^(0.1*K26)+10^(0.1*L26)+10^(0.1*M26)+10^(0.1*N26)+10^(0.1*O26)+10^(0.1*P26)+10^(0.1*Q26)+10^(0.1*R26)+10^(0.1*S26)+10^(0.1*T26)+10^(0.1*U26)+10^(0.1*V26))","v":{"$error":"#NUM!"}}]
[{"$f":"Grunddaten!C7","v":"DAL 359600"},{"$f":"B$4+B$5*LOG(Grunddaten!$G7)+B$6*LOG(Grunddaten!$F7)+B$7*LOG(Grunddaten!$H7)","v":{"$error":"#NUM!"}},{"$f":"C$4+C$5*LOG(Grunddaten!$G7)+C$6*LOG(Grunddaten!$F7)+C$7*LOG(Grunddaten!$H7)","v":{"$error":"#NUM!"}},{"$f":"D$4+D$5*LOG(Grunddaten!$G7)+D$6*LOG(Grunddaten!$F7)+D$7*LOG(Grunddaten!$H7)","v":{"$error":"#NUM!"}},{"$f":"E$4+E$5*LOG(Grunddaten!$G7)+E$6*LOG(Grunddaten!$F7)+E$7*LOG(Grunddaten!$H7)","v":{"$error":"#NUM!"}},{"$f":"F$4+F$5*LOG(Grunddaten!$G7)+F$6*LOG(Grunddaten!$F7)+F$7*LOG(Grunddaten!$H7)","v":{"$error":"#NUM!"}},{"$f":"G$4+G$5*LOG(Grunddaten!$G7)+G$6*LOG(Grunddaten!$F7)+G$7*LOG(Grunddaten!$H7)","v":{"$error":"#NUM!"}},{"$f":"H$4+H$5*LOG(Grunddaten!$G7)+H$6*LOG(Grunddaten!$F7)+H$7*LOG(Grunddaten!$H7)","v":{"$error":"#NUM!"}},{"$f":"I$4+I$5*LOG(Grunddaten!$G7)+I$6*LOG(Grunddaten!$F7)+I$7*LOG(Grunddaten!$H7)","v":{"$error":"#NUM!"}},{"$f":"J$4+J$5*LOG(Grunddaten!$G7)+J$6*LOG(Grunddaten!$F7)+J$7*LOG(Grunddaten!$H7)","v":{"$error":"#NUM!"}},{"$f":"K$4+K$5*LOG(Grunddaten!$G7)+K$6*LOG(Grunddaten!$F7)+K$7*LOG(Grunddaten!$H7)","v":{"$error":"#NUM!"}},{"$f":"L$4+L$5*LOG(Grunddaten!$G7)+L$6*LOG(Grunddaten!$F7)+L$7*LOG(Grunddaten!$H7)","v":{"$error":"#NUM!"}},{"$f":"M$4+M$5*LOG(Grunddaten!$G7)+M$6*LOG(Grunddaten!$F7)+M$7*LOG(Grunddaten!$H7)","v":{"$error":"#NUM!"}},{"$f":"N$4+N$5*LOG(Grunddaten!$G7)+N$6*LOG(Grunddaten!$F7)+N$7*LOG(Grunddaten!$H7)","v":{"$error":"#NUM!"}},{"$f":"O$4+O$5*LOG(Grunddaten!$G7)+O$6*LOG(Grunddaten!$F7)+O$7*LOG(Grunddaten!$H7)","v":{"$error":"#NUM!"}},{"$f":"P$4+P$5*LOG(Grunddaten!$G7)+P$6*LOG(Grunddaten!$F7)+P$7*LOG(Grunddaten!$H7)","v":{"$error":"#NUM!"}},{"$f":"Q$4+Q$5*LOG(Grunddaten!$G7)+Q$6*LOG(Grunddaten!$F7)+Q$7*LOG(Grunddaten!$H7)","v":{"$error":"#NUM!"}},{"$f":"R$4+R$5*LOG(Grunddaten!$G7)+R$6*LOG(Grunddaten!$F7)+R$7*LOG(Grunddaten!$H7)","v":{"$error":"#NUM!"}},{"$f":"S$4+S$5*LOG(Grunddaten!$G7)+S$6*LOG(Grunddaten!$F7)+S$7*LOG(Grunddaten!$H7)","v":{"$error":"#NUM!"}},{"$f":"T$4+T$5*LOG(Grunddaten!$G7)+T$6*LOG(Grunddaten!$F7)+T$7*LOG(Grunddaten!$H7)","v":{"$error":"#NUM!"}},{"$f":"U$4+U$5*LOG(Grunddaten!$G7)+U$6*LOG(Grunddaten!$F7)+U$7*LOG(Grunddaten!$H7)","v":{"$error":"#NUM!"}},{"$f":"V$4+V$5*LOG(Grunddaten!$G7)+V$6*LOG(Grunddaten!$F7)+V$7*LOG(Grunddaten!$H7)","v":{"$error":"#NUM!"}},{"$f":"10*LOG(10^(0.1*B27)+10^(0.1*C27)+10^(0.1*D27)+10^(0.1*E27)+10^(0.1*F27)+10^(0.1*G27)+10^(0.1*H27)+10^(0.1*I27)+10^(0.1*J27)+10^(0.1*K27)+10^(0.1*L27)+10^(0.1*M27)+10^(0.1*N27)+10^(0.1*O27)+10^(0.1*P27)+10^(0.1*Q27)+10^(0.1*R27)+10^(0.1*S27)+10^(0.1*T27)+10^(0.1*U27)+10^(0.1*V27))","v":{"$error":"#NUM!"}}]
[{"$f":"Grunddaten!C8","v":"DAL 359800"},{"$f":"B$8+B$9*LOG(Grunddaten!$G8)+B$10*LOG(Grunddaten!$F8)+B$11*LOG(Grunddaten!$H8)","v":{"$error":"#NUM!"}},{"$f":"C$8+C$9*LOG(Grunddaten!$G8)+C$10*LOG(Grunddaten!$F8)+C$11*LOG(Grunddaten!$H8)","v":{"$error":"#NUM!"}},{"$f":"D$8+D$9*LOG(Grunddaten!$G8)+D$10*LOG(Grunddaten!$F8)+D$11*LOG(Grunddaten!$H8)","v":{"$error":"#NUM!"}},{"$f":"E$8+E$9*LOG(Grunddaten!$G8)+E$10*LOG(Grunddaten!$F8)+E$11*LOG(Grunddaten!$H8)","v":{"$error":"#NUM!"}},{"$f":"F$8+F$9*LOG(Grunddaten!$G8)+F$10*LOG(Grunddaten!$F8)+F$11*LOG(Grunddaten!$H8)","v":{"$error":"#NUM!"}},{"$f":"G$8+G$9*LOG(Grunddaten!$G8)+G$10*LOG(Grunddaten!$F8)+G$11*LOG(Grunddaten!$H8)","v":{"$error":"#NUM!"}},{"$f":"H$8+H$9*LOG(Grunddaten!$G8)+H$10*LOG(Grunddaten!$F8)+H$11*LOG(Grunddaten!$H8)","v":{"$error":"#NUM!"}},{"$f":"I$8+I$9*LOG(Grunddaten!$G8)+I$10*LOG(Grunddaten!$F8)+I$11*LOG(Grunddaten!$H8)","v":{"$error":"#NUM!"}},{"$f":"J$8+J$9*LOG(Grunddaten!$G8)+J$10*LOG(Grunddaten!$F8)+J$11*LOG(Grunddaten!$H8)","v":{"$error":"#NUM!"}},{"$f":"K$8+K$9*LOG(Grunddaten!$G8)+K$10*LOG(Grunddaten!$F8)+K$11*LOG(Grunddaten!$H8)","v":{"$error":"#NUM!"}},{"$f":"L$8+L$9*LOG(Grunddaten!$G8)+L$10*LOG(Grunddaten!$F8)+L$11*LOG(Grunddaten!$H8)","v":{"$error":"#NUM!"}},{"$f":"M$8+M$9*LOG(Grunddaten!$G8)+M$10*LOG(Grunddaten!$F8)+M$11*LOG(Grunddaten!$H8)","v":{"$error":"#NUM!"}},{"$f":"N$8+N$9*LOG(Grunddaten!$G8)+N$10*LOG(Grunddaten!$F8)+N$11*LOG(Grunddaten!$H8)","v":{"$error":"#NUM!"}},{"$f":"O$8+O$9*LOG(Grunddaten!$G8)+O$10*LOG(Grunddaten!$F8)+O$11*LOG(Grunddaten!$H8)","v":{"$error":"#NUM!"}},{"$f":"P$8+P$9*LOG(Grunddaten!$G8)+P$10*LOG(Grunddaten!$F8)+P$11*LOG(Grunddaten!$H8)","v":{"$error":"#NUM!"}},{"$f":"Q$8+Q$9*LOG(Grunddaten!$G8)+Q$10*LOG(Grunddaten!$F8)+Q$11*LOG(Grunddaten!$H8)","v":{"$error":"#NUM!"}},{"$f":"R$8+R$9*LOG(Grunddaten!$G8)+R$10*LOG(Grunddaten!$F8)+R$11*LOG(Grunddaten!$H8)","v":{"$error":"#NUM!"}},{"$f":"S$8+S$9*LOG(Grunddaten!$G8)+S$10*LOG(Grunddaten!$F8)+S$11*LOG(Grunddaten!$H8)","v":{"$error":"#NUM!"}},{"$f":"T$8+T$9*LOG(Grunddaten!$G8)+T$10*LOG(Grunddaten!$F8)+T$11*LOG(Grunddaten!$H8)","v":{"$error":"#NUM!"}},{"$f":"U$8+U$9*LOG(Grunddaten!$G8)+U$10*LOG(Grunddaten!$F8)+U$11*LOG(Grunddaten!$H8)","v":{"$error":"#NUM!"}},{"$f":"V$8+V$9*LOG(Grunddaten!$G8)+V$10*LOG(Grunddaten!$F8)+V$11*LOG(Grunddaten!$H8)","v":{"$error":"#NUM!"}},{"$f":"10*LOG(10^(0.1*B28)+10^(0.1*C28)+10^(0.1*D28)+10^(0.1*E28)+10^(0.1*F28)+10^(0.1*G28)+10^(0.1*H28)+10^(0.1*I28)+10^(0.1*J28)+10^(0.1*K28)+10^(0.1*L28)+10^(0.1*M28)+10^(0.1*N28)+10^(0.1*O28)+10^(0.1*P28)+10^(0.1*Q28)+10^(0.1*R28)+10^(0.1*S28)+10^(0.1*T28)+10^(0.1*U28)+10^(0.1*V28))","v":{"$error":"#NUM!"}}]
[{"$f":"Grunddaten!C9","v":"DAL 358300"},{"$f":"B$8+B$9*LOG(Grunddaten!$G9)+B$10*LOG(Grunddaten!$F9)+B$11*LOG(Grunddaten!$H9)","v":{"$error":"#NUM!"}},{"$f":"C$8+C$9*LOG(Grunddaten!$G9)+C$10*LOG(Grunddaten!$F9)+C$11*LOG(Grunddaten!$H9)","v":{"$error":"#NUM!"}},{"$f":"D$8+D$9*LOG(Grunddaten!$G9)+D$10*LOG(Grunddaten!$F9)+D$11*LOG(Grunddaten!$H9)","v":{"$error":"#NUM!"}},{"$f":"E$8+E$9*LOG(Grunddaten!$G9)+E$10*LOG(Grunddaten!$F9)+E$11*LOG(Grunddaten!$H9)","v":{"$error":"#NUM!"}},{"$f":"F$8+F$9*LOG(Grunddaten!$G9)+F$10*LOG(Grunddaten!$F9)+F$11*LOG(Grunddaten!$H9)","v":{"$error":"#NUM!"}},{"$f":"G$8+G$9*LOG(Grunddaten!$G9)+G$10*LOG(Grunddaten!$F9)+G$11*LOG(Grunddaten!$H9)","v":{"$error":"#NUM!"}},{"$f":"H$8+H$9*LOG(Grunddaten!$G9)+H$10*LOG(Grunddaten!$F9)+H$11*LOG(Grunddaten!$H9)","v":{"$error":"#NUM!"}},{"$f":"I$8+I$9*LOG(Grunddaten!$G9)+I$10*LOG(Grunddaten!$F9)+I$11*LOG(Grunddaten!$H9)","v":{"$error":"#NUM!"}},{"$f":"J$8+J$9*LOG(Grunddaten!$G9)+J$10*LOG(Grunddaten!$F9)+J$11*LOG(Grunddaten!$H9)","v":{"$error":"#NUM!"}},{"$f":"K$8+K$9*LOG(Grunddaten!$G9)+K$10*LOG(Grunddaten!$F9)+K$11*LOG(Grunddaten!$H9)","v":{"$error":"#NUM!"}},{"$f":"L$8+L$9*LOG(Grunddaten!$G9)+L$10*LOG(Grunddaten!$F9)+L$11*LOG(Grunddaten!$H9)","v":{"$error":"#NUM!"}},{"$f":"M$8+M$9*LOG(Grunddaten!$G9)+M$10*LOG(Grunddaten!$F9)+M$11*LOG(Grunddaten!$H9)","v":{"$error":"#NUM!"}},{"$f":"N$8+N$9*LOG(Grunddaten!$G9)+N$10*LOG(Grunddaten!$F9)+N$11*LOG(Grunddaten!$H9)","v":{"$error":"#NUM!"}},{"$f":"O$8+O$9*LOG(Grunddaten!$G9)+O$10*LOG(Grunddaten!$F9)+O$11*LOG(Grunddaten!$H9)","v":{"$error":"#NUM!"}},{"$f":"P$8+P$9*LOG(Grunddaten!$G9)+P$10*LOG(Grunddaten!$F9)+P$11*LOG(Grunddaten!$H9)","v":{"$error":"#NUM!"}},{"$f":"Q$8+Q$9*LOG(Grunddaten!$G9)+Q$10*LOG(Grunddaten!$F9)+Q$11*LOG(Grunddaten!$H9)","v":{"$error":"#NUM!"}},{"$f":"R$8+R$9*LOG(Grunddaten!$G9)+R$10*LOG(Grunddaten!$F9)+R$11*LOG(Grunddaten!$H9)","v":{"$error":"#NUM!"}},{"$f":"S$8+S$9*LOG(Grunddaten!$G9)+S$10*LOG(Grunddaten!$F9)+S$11*LOG(Grunddaten!$H9)","v":{"$error":"#NUM!"}},{"$f":"T$8+T$9*LOG(Grunddaten!$G9)+T$10*LOG(Grunddaten!$F9)+T$11*LOG(Grunddaten!$H9)","v":{"$error":"#NUM!"}},{"$f":"U$8+U$9*LOG(Grunddaten!$G9)+U$10*LOG(Grunddaten!$F9)+U$11*LOG(Grunddaten!$H9)","v":{"$error":"#NUM!"}},{"$f":"V$8+V$9*LOG(Grunddaten!$G9)+V$10*LOG(Grunddaten!$F9)+V$11*LOG(Grunddaten!$H9)","v":{"$error":"#NUM!"}},{"$error":"#NUM!"}]
[{"$f":"Grunddaten!C10","v":"DAL 358400"},{"$f":"B$8+B$9*LOG(Grunddaten!$G10)+B$10*LOG(Grunddaten!$F10)+B$11*LOG(Grunddaten!$H10)","v":{"$error":"#NUM!"}},{"$f":"C$8+C$9*LOG(Grunddaten!$G10)+C$10*LOG(Grunddaten!$F10)+C$11*LOG(Grunddaten!$H10)","v":{"$error":"#NUM!"}},{"$f":"D$8+D$9*LOG(Grunddaten!$G10)+D$10*LOG(Grunddaten!$F10)+D$11*LOG(Grunddaten!$H10)","v":{"$error":"#NUM!"}},{"$f":"E$8+E$9*LOG(Grunddaten!$G10)+E$10*LOG(Grunddaten!$F10)+E$11*LOG(Grunddaten!$H10)","v":{"$error":"#NUM!"}},{"$f":"F$8+F$9*LOG(Grunddaten!$G10)+F$10*LOG(Grunddaten!$F10)+F$11*LOG(Grunddaten!$H10)","v":{"$error":"#NUM!"}},{"$f":"G$8+G$9*LOG(Grunddaten!$G10)+G$10*LOG(Grunddaten!$F10)+G$11*LOG(Grunddaten!$H10)","v":{"$error":"#NUM!"}},{"$f":"H$8+H$9*LOG(Grunddaten!$G10)+H$10*LOG(Grunddaten!$F10)+H$11*LOG(Grunddaten!$H10)","v":{"$error":"#NUM!"}},{"$f":"I$8+I$9*LOG(Grunddaten!$G10)+I$10*LOG(Grunddaten!$F10)+I$11*LOG(Grunddaten!$H10)","v":{"$error":"#NUM!"}},{"$f":"J$8+J$9*LOG(Grunddaten!$G10)+J$10*LOG(Grunddaten!$F10)+J$11*LOG(Grunddaten!$H10)","v":{"$error":"#NUM!"}},{"$f":"K$8+K$9*LOG(Grunddaten!$G10)+K$10*LOG(Grunddaten!$F10)+K$11*LOG(Grunddaten!$H10)","v":{"$error":"#NUM!"}},{"$f":"L$8+L$9*LOG(Grunddaten!$G10)+L$10*LOG(Grunddaten!$F10)+L$11*LOG(Grunddaten!$H10)","v":{"$error":"#NUM!"}},{"$f":"M$8+M$9*LOG(Grunddaten!$G10)+M$10*LOG(Grunddaten!$F10)+M$11*LOG(Grunddaten!$H10)","v":{"$error":"#NUM!"}},{"$f":"N$8+N$9*LOG(Grunddaten!$G10)+N$10*LOG(Grunddaten!$F10)+N$11*LOG(Grunddaten!$H10)","v":{"$error":"#NUM!"}},{"$f":"O$8+O$9*LOG(Grunddaten!$G10)+O$10*LOG(Grunddaten!$F10)+O$11*LOG(Grunddaten!$H10)","v":{"$error":"#NUM!"}},{"$f":"P$8+P$9*LOG(Grunddaten!$G10)+P$10*LOG(Grunddaten!$F10)+P$11*LOG(Grunddaten!$H10)","v":{"$error":"#NUM!"}},{"$f":"Q$8+Q$9*LOG(Grunddaten!$G10)+Q$10*LOG(Grunddaten!$F10)+Q$11*LOG(Grunddaten!$H10)","v":{"$error":"#NUM!"}},{"$f":"R$8+R$9*LOG(Grunddaten!$G10)+R$10*LOG(Grunddaten!$F10)+R$11*LOG(Grunddaten!$H10)","v":{"$error":"#NUM!"}},{"$f":"S$8+S$9*LOG(Grunddaten!$G10)+S$10*LOG(Grunddaten!$F10)+S$11*LOG(Grunddaten!$H10)","v":{"$error":"#NUM!"}},{"$f":"T$8+T$9*LOG(Grunddaten!$G10)+T$10*LOG(Grunddaten!$F10)+T$11*LOG(Grunddaten!$H10)","v":{"$error":"#NUM!"}},{"$f":"U$8+U$9*LOG(Grunddaten!$G10)+U$10*LOG(Grunddaten!$F10)+U$11*LOG(Grunddaten!$H10)","v":{"$error":"#NUM!"}},{"$f":"V$8+V$9*LOG(Grunddaten!$G10)+V$10*LOG(Grunddaten!$F10)+V$11*LOG(Grunddaten!$H10)","v":{"$error":"#NUM!"}},{"$error":"#NUM!"}]
[{"$f":"Grunddaten!C11","v":"DAL 358500"},{"$f":"B$8+B$9*LOG(Grunddaten!$G11)+B$10*LOG(Grunddaten!$F11)+B$11*LOG(Grunddaten!$H11)","v":{"$error":"#NUM!"}},{"$f":"C$8+C$9*LOG(Grunddaten!$G11)+C$10*LOG(Grunddaten!$F11)+C$11*LOG(Grunddaten!$H11)","v":{"$error":"#NUM!"}},{"$f":"D$8+D$9*LOG(Grunddaten!$G11)+D$10*LOG(Grunddaten!$F11)+D$11*LOG(Grunddaten!$H11)","v":{"$error":"#NUM!"}},{"$f":"E$8+E$9*LOG(Grunddaten!$G11)+E$10*LOG(Grunddaten!$F11)+E$11*LOG(Grunddaten!$H11)","v":{"$error":"#NUM!"}},{"$f":"F$8+F$9*LOG(Grunddaten!$G11)+F$10*LOG(Grunddaten!$F11)+F$11*LOG(Grunddaten!$H11)","v":{"$error":"#NUM!"}},{"$f":"G$8+G$9*LOG(Grunddaten!$G11)+G$10*LOG(Grunddaten!$F11)+G$11*LOG(Grunddaten!$H11)","v":{"$error":"#NUM!"}},{"$f":"H$8+H$9*LOG(Grunddaten!$G11)+H$10*LOG(Grunddaten!$F11)+H$11*LOG(Grunddaten!$H11)","v":{"$error":"#NUM!"}},{"$f":"I$8+I$9*LOG(Grunddaten!$G11)+I$10*LOG(Grunddaten!$F11)+I$11*LOG(Grunddaten!$H11)","v":{"$error":"#NUM!"}},{"$f":"J$8+J$9*LOG(Grunddaten!$G11)+J$10*LOG(Grunddaten!$F11)+J$11*LOG(Grunddaten!$H11)","v":{"$error":"#NUM!"}},{"$f":"K$8+K$9*LOG(Grunddaten!$G11)+K$10*LOG(Grunddaten!$F11)+K$11*LOG(Grunddaten!$H11)","v":{"$error":"#NUM!"}},{"$f":"L$8+L$9*LOG(Grunddaten!$G11)+L$10*LOG(Grunddaten!$F11)+L$11*LOG(Grunddaten!$H11)","v":{"$error":"#NUM!"}},{"$f":"M$8+M$9*LOG(Grunddaten!$G11)+M$10*LOG(Grunddaten!$F11)+M$11*LOG(Grunddaten!$H11)","v":{"$error":"#NUM!"}},{"$f":"N$8+N$9*LOG(Grunddaten!$G11)+N$10*LOG(Grunddaten!$F11)+N$11*LOG(Grunddaten!$H11)","v":{"$error":"#NUM!"}},{"$f":"O$8+O$9*LOG(Grunddaten!$G11)+O$10*LOG(Grunddaten!$F11)+O$11*LOG(Grunddaten!$H11)","v":{"$error":"#NUM!"}},{"$f":"P$8+P$9*LOG(Grunddaten!$G11)+P$10*LOG(Grunddaten!$F11)+P$11*LOG(Grunddaten!$H11)","v":{"$error":"#NUM!"}},{"$f":"Q$8+Q$9*LOG(Grunddaten!$G11)+Q$10*LOG(Grunddaten!$F11)+Q$11*LOG(Grunddaten!$H11)","v":{"$error":"#NUM!"}},{"$f":"R$8+R$9*LOG(Grunddaten!$G11)+R$10*LOG(Grunddaten!$F11)+R$11*LOG(Grunddaten!$H11)","v":{"$error":"#NUM!"}},{"$f":"S$8+S$9*LOG(Grunddaten!$G11)+S$10*LOG(Grunddaten!$F11)+S$11*LOG(Grunddaten!$H11)","v":{"$error":"#NUM!"}},{"$f":"T$8+T$9*LOG(Grunddaten!$G11)+T$10*LOG(Grunddaten!$F11)+T$11*LOG(Grunddaten!$H11)","v":{"$error":"#NUM!"}},{"$f":"U$8+U$9*LOG(Grunddaten!$G11)+U$10*LOG(Grunddaten!$F11)+U$11*LOG(Grunddaten!$H11)","v":{"$error":"#NUM!"}},{"$f":"V$8+V$9*LOG(Grunddaten!$G11)+V$10*LOG(Grunddaten!$F11)+V$11*LOG(Grunddaten!$H11)","v":{"$error":"#NUM!"}},{"$error":"#NUM!"}]
[{"$f":"Grunddaten!C12","v":"DAL 358600"},{"$f":"B$8+B$9*LOG(Grunddaten!$G12)+B$10*LOG(Grunddaten!$F12)+B$11*LOG(Grunddaten!$H12)","v":{"$error":"#NUM!"}},{"$f":"C$8+C$9*LOG(Grunddaten!$G12)+C$10*LOG(Grunddaten!$F12)+C$11*LOG(Grunddaten!$H12)","v":{"$error":"#NUM!"}},{"$f":"D$8+D$9*LOG(Grunddaten!$G12)+D$10*LOG(Grunddaten!$F12)+D$11*LOG(Grunddaten!$H12)","v":{"$error":"#NUM!"}},{"$f":"E$8+E$9*LOG(Grunddaten!$G12)+E$10*LOG(Grunddaten!$F12)+E$11*LOG(Grunddaten!$H12)","v":{"$error":"#NUM!"}},{"$f":"F$8+F$9*LOG(Grunddaten!$G12)+F$10*LOG(Grunddaten!$F12)+F$11*LOG(Grunddaten!$H12)","v":{"$error":"#NUM!"}},{"$f":"G$8+G$9*LOG(Grunddaten!$G12)+G$10*LOG(Grunddaten!$F12)+G$11*LOG(Grunddaten!$H12)","v":{"$error":"#NUM!"}},{"$f":"H$8+H$9*LOG(Grunddaten!$G12)+H$10*LOG(Grunddaten!$F12)+H$11*LOG(Grunddaten!$H12)","v":{"$error":"#NUM!"}},{"$f":"I$8+I$9*LOG(Grunddaten!$G12)+I$10*LOG(Grunddaten!$F12)+I$11*LOG(Grunddaten!$H12)","v":{"$error":"#NUM!"}},{"$f":"J$8+J$9*LOG(Grunddaten!$G12)+J$10*LOG(Grunddaten!$F12)+J$11*LOG(Grunddaten!$H12)","v":{"$error":"#NUM!"}},{"$f":"K$8+K$9*LOG(Grunddaten!$G12)+K$10*LOG(Grunddaten!$F12)+K$11*LOG(Grunddaten!$H12)","v":{"$error":"#NUM!"}},{"$f":"L$8+L$9*LOG(Grunddaten!$G12)+L$10*LOG(Grunddaten!$F12)+L$11*LOG(Grunddaten!$H12)","v":{"$error":"#NUM!"}},{"$f":"M$8+M$9*LOG(Grunddaten!$G12)+M$10*LOG(Grunddaten!$F12)+M$11*LOG(Grunddaten!$H12)","v":{"$error":"#NUM!"}},{"$f":"N$8+N$9*LOG(Grunddaten!$G12)+N$10*LOG(Grunddaten!$F12)+N$11*LOG(Grunddaten!$H12)","v":{"$error":"#NUM!"}},{"$f":"O$8+O$9*LOG(Grunddaten!$G12)+O$10*LOG(Grunddaten!$F12)+O$11*LOG(Grunddaten!$H12)","v":{"$error":"#NUM!"}},{"$f":"P$8+P$9*LOG(Grunddaten!$G12)+P$10*LOG(Grunddaten!$F12)+P$11*LOG(Grunddaten!$H12)","v":{"$error":"#NUM!"}},{"$f":"Q$8+Q$9*LOG(Grunddaten!$G12)+Q$10*LOG(Grunddaten!$F12)+Q$11*LOG(Grunddaten!$H12)","v":{"$error":"#NUM!"}},{"$f":"R$8+R$9*LOG(Grunddaten!$G12)+R$10*LOG(Grunddaten!$F12)+R$11*LOG(Grunddaten!$H12)","v":{"$error":"#NUM!"}},{"$f":"S$8+S$9*LOG(Grunddaten!$G12)+S$10*LOG(Grunddaten!$F12)+S$11*LOG(Grunddaten!$H12)","v":{"$error":"#NUM!"}},{"$f":"T$8+T$9*LOG(Grunddaten!$G12)+T$10*LOG(Grunddaten!$F12)+T$11*LOG(Grunddaten!$H12)","v":{"$error":"#NUM!"}},{"$f":"U$8+U$9*LOG(Grunddaten!$G12)+U$10*LOG(Grunddaten!$F12)+U$11*LOG(Grunddaten!$H12)","v":{"$error":"#NUM!"}},{"$f":"V$8+V$9*LOG(Grunddaten!$G12)+V$10*LOG(Grunddaten!$F12)+V$11*LOG(Grunddaten!$H12)","v":{"$error":"#NUM!"}},{"$error":"#NUM!"}]
[{"$f":"Grunddaten!C13","v":"DAL 358800"},{"$f":"B$8+B$9*LOG(Grunddaten!$G13)+B$10*LOG(Grunddaten!$F13)+B$11*LOG(Grunddaten!$H13)","v":{"$error":"#NUM!"}},{"$f":"C$8+C$9*LOG(Grunddaten!$G13)+C$10*LOG(Grunddaten!$F13)+C$11*LOG(Grunddaten!$H13)","v":{"$error":"#NUM!"}},{"$f":"D$8+D$9*LOG(Grunddaten!$G13)+D$10*LOG(Grunddaten!$F13)+D$11*LOG(Grunddaten!$H13)","v":{"$error":"#NUM!"}},{"$f":"E$8+E$9*LOG(Grunddaten!$G13)+E$10*LOG(Grunddaten!$F13)+E$11*LOG(Grunddaten!$H13)","v":{"$error":"#NUM!"}},{"$f":"F$8+F$9*LOG(Grunddaten!$G13)+F$10*LOG(Grunddaten!$F13)+F$11*LOG(Grunddaten!$H13)","v":{"$error":"#NUM!"}},{"$f":"G$8+G$9*LOG(Grunddaten!$G13)+G$10*LOG(Grunddaten!$F13)+G$11*LOG(Grunddaten!$H13)","v":{"$error":"#NUM!"}},{"$f":"H$8+H$9*LOG(Grunddaten!$G13)+H$10*LOG(Grunddaten!$F13)+H$11*LOG(Grunddaten!$H13)","v":{"$error":"#NUM!"}},{"$f":"I$8+I$9*LOG(Grunddaten!$G13)+I$10*LOG(Grunddaten!$F13)+I$11*LOG(Grunddaten!$H13)","v":{"$error":"#NUM!"}},{"$f":"J$8+J$9*LOG(Grunddaten!$G13)+J$10*LOG(Grunddaten!$F13)+J$11*LOG(Grunddaten!$H13)","v":{"$error":"#NUM!"}},{"$f":"K$8+K$9*LOG(Grunddaten!$G13)+K$10*LOG(Grunddaten!$F13)+K$11*LOG(Grunddaten!$H13)","v":{"$error":"#NUM!"}},{"$f":"L$8+L$9*LOG(Grunddaten!$G13)+L$10*LOG(Grunddaten!$F13)+L$11*LOG(Grunddaten!$H13)","v":{"$error":"#NUM!"}},{"$f":"M$8+M$9*LOG(Grunddaten!$G13)+M$10*LOG(Grunddaten!$F13)+M$11*LOG(Grunddaten!$H13)","v":{"$error":"#NUM!"}},{"$f":"N$8+N$9*LOG(Grunddaten!$G13)+N$10*LOG(Grunddaten!$F13)+N$11*LOG(Grunddaten!$H13)","v":{"$error":"#NUM!"}},{"$f":"O$8+O$9*LOG(Grunddaten!$G13)+O$10*LOG(Grunddaten!$F13)+O$11*LOG(Grunddaten!$H13)","v":{"$error":"#NUM!"}},{"$f":"P$8+P$9*LOG(Grunddaten!$G13)+P$10*LOG(Grunddaten!$F13)+P$11*LOG(Grunddaten!$H13)","v":{"$error":"#NUM!"}},{"$f":"Q$8+Q$9*LOG(Grunddaten!$G13)+Q$10*LOG(Grunddaten!$F13)+Q$11*LOG(Grunddaten!$H13)","v":{"$error":"#NUM!"}},{"$f":"R$8+R$9*LOG(Grunddaten!$G13)+R$10*LOG(Grunddaten!$F13)+R$11*LOG(Grunddaten!$H13)","v":{"$error":"#NUM!"}},{"$f":"S$8+S$9*LOG(Grunddaten!$G13)+S$10*LOG(Grunddaten!$F13)+S$11*LOG(Grunddaten!$H13)","v":{"$error":"#NUM!"}},{"$f":"T$8+T$9*LOG(Grunddaten!$G13)+T$10*LOG(Grunddaten!$F13)+T$11*LOG(Grunddaten!$H13)","v":{"$error":"#NUM!"}},{"$f":"U$8+U$9*LOG(Grunddaten!$G13)+U$10*LOG(Grunddaten!$F13)+U$11*LOG(Grunddaten!$H13)","v":{"$error":"#NUM!"}},{"$f":"V$8+V$9*LOG(Grunddaten!$G13)+V$10*LOG(Grunddaten!$F13)+V$11*LOG(Grunddaten!$H13)","v":{"$error":"#NUM!"}},{"$error":"#NUM!"}]
[{"$f":"Grunddaten!C14","v":"DRS100"},{"$f":"B$8+B$9*LOG(Grunddaten!$G14)+B$10*LOG(Grunddaten!$F14)+B$11*LOG(Grunddaten!$H14)","v":{"$error":"#NUM!"}},{"$f":"C$8+C$9*LOG(Grunddaten!$G14)+C$10*LOG(Grunddaten!$F14)+C$11*LOG(Grunddaten!$H14)","v":{"$error":"#NUM!"}},{"$f":"D$8+D$9*LOG(Grunddaten!$G14)+D$10*LOG(Grunddaten!$F14)+D$11*LOG(Grunddaten!$H14)","v":{"$error":"#NUM!"}},{"$f":"E$8+E$9*LOG(Grunddaten!$G14)+E$10*LOG(Grunddaten!$F14)+E$11*LOG(Grunddaten!$H14)","v":{"$error":"#NUM!"}},{"$f":"F$8+F$9*LOG(Grunddaten!$G14)+F$10*LOG(Grunddaten!$F14)+F$11*LOG(Grunddaten!$H14)","v":{"$error":"#NUM!"}},{"$f":"G$8+G$9*LOG(Grunddaten!$G14)+G$10*LOG(Grunddaten!$F14)+G$11*LOG(Grunddaten!$H14)","v":{"$error":"#NUM!"}},{"$f":"H$8+H$9*LOG(Grunddaten!$G14)+H$10*LOG(Grunddaten!$F14)+H$11*LOG(Grunddaten!$H14)","v":{"$error":"#NUM!"}},{"$f":"I$8+I$9*LOG(Grunddaten!$G14)+I$10*LOG(Grunddaten!$F14)+I$11*LOG(Grunddaten!$H14)","v":{"$error":"#NUM!"}},{"$f":"J$8+J$9*LOG(Grunddaten!$G14)+J$10*LOG(Grunddaten!$F14)+J$11*LOG(Grunddaten!$H14)","v":{"$error":"#NUM!"}},{"$f":"K$8+K$9*LOG(Grunddaten!$G14)+K$10*LOG(Grunddaten!$F14)+K$11*LOG(Grunddaten!$H14)","v":{"$error":"#NUM!"}},{"$f":"L$8+L$9*LOG(Grunddaten!$G14)+L$10*LOG(Grunddaten!$F14)+L$11*LOG(Grunddaten!$H14)","v":{"$error":"#NUM!"}},{"$f":"M$8+M$9*LOG(Grunddaten!$G14)+M$10*LOG(Grunddaten!$F14)+M$11*LOG(Grunddaten!$H14)","v":{"$error":"#NUM!"}},{"$f":"N$8+N$9*LOG(Grunddaten!$G14)+N$10*LOG(Grunddaten!$F14)+N$11*LOG(Grunddaten!$H14)","v":{"$error":"#NUM!"}},{"$f":"O$8+O$9*LOG(Grunddaten!$G14)+O$10*LOG(Grunddaten!$F14)+O$11*LOG(Grunddaten!$H14)","v":{"$error":"#NUM!"}},{"$f":"P$8+P$9*LOG(Grunddaten!$G14)+P$10*LOG(Grunddaten!$F14)+P$11*LOG(Grunddaten!$H14)","v":{"$error":"#NUM!"}},{"$f":"Q$8+Q$9*LOG(Grunddaten!$G14)+Q$10*LOG(Grunddaten!$F14)+Q$11*LOG(Grunddaten!$H14)","v":{"$error":"#NUM!"}},{"$f":"R$8+R$9*LOG(Grunddaten!$G14)+R$10*LOG(Grunddaten!$F14)+R$11*LOG(Grunddaten!$H14)","v":{"$error":"#NUM!"}},{"$f":"S$8+S$9*LOG(Grunddaten!$G14)+S$10*LOG(Grunddaten!$F14)+S$11*LOG(Grunddaten!$H14)","v":{"$error":"#NUM!"}},{"$f":"T$8+T$9*LOG(Grunddaten!$G14)+T$10*LOG(Grunddaten!$F14)+T$11*LOG(Grunddaten!$H14)","v":{"$error":"#NUM!"}},{"$f":"U$8+U$9*LOG(Grunddaten!$G14)+U$10*LOG(Grunddaten!$F14)+U$11*LOG(Grunddaten!$H14)","v":{"$error":"#NUM!"}},{"$f":"V$8+V$9*LOG(Grunddaten!$G14)+V$10*LOG(Grunddaten!$F14)+V$11*LOG(Grunddaten!$H14)","v":{"$error":"#NUM!"}},{"$error":"#NUM!"}]
[{"$f":"Grunddaten!C15","v":"DRS125"},{"$f":"B$8+B$9*LOG(Grunddaten!$G15)+B$10*LOG(Grunddaten!$F15)+B$11*LOG(Grunddaten!$H15)","v":{"$error":"#NUM!"}},{"$f":"C$8+C$9*LOG(Grunddaten!$G15)+C$10*LOG(Grunddaten!$F15)+C$11*LOG(Grunddaten!$H15)","v":{"$error":"#NUM!"}},{"$f":"D$8+D$9*LOG(Grunddaten!$G15)+D$10*LOG(Grunddaten!$F15)+D$11*LOG(Grunddaten!$H15)","v":{"$error":"#NUM!"}},{"$f":"E$8+E$9*LOG(Grunddaten!$G15)+E$10*LOG(Grunddaten!$F15)+E$11*LOG(Grunddaten!$H15)","v":{"$error":"#NUM!"}},{"$f":"F$8+F$9*LOG(Grunddaten!$G15)+F$10*LOG(Grunddaten!$F15)+F$11*LOG(Grunddaten!$H15)","v":{"$error":"#NUM!"}},{"$f":"G$8+G$9*LOG(Grunddaten!$G15)+G$10*LOG(Grunddaten!$F15)+G$11*LOG(Grunddaten!$H15)","v":{"$error":"#NUM!"}},{"$f":"H$8+H$9*LOG(Grunddaten!$G15)+H$10*LOG(Grunddaten!$F15)+H$11*LOG(Grunddaten!$H15)","v":{"$error":"#NUM!"}},{"$f":"I$8+I$9*LOG(Grunddaten!$G15)+I$10*LOG(Grunddaten!$F15)+I$11*LOG(Grunddaten!$H15)","v":{"$error":"#NUM!"}},{"$f":"J$8+J$9*LOG(Grunddaten!$G15)+J$10*LOG(Grunddaten!$F15)+J$11*LOG(Grunddaten!$H15)","v":{"$error":"#NUM!"}},{"$f":"K$8+K$9*LOG(Grunddaten!$G15)+K$10*LOG(Grunddaten!$F15)+K$11*LOG(Grunddaten!$H15)","v":{"$error":"#NUM!"}},{"$f":"L$8+L$9*LOG(Grunddaten!$G15)+L$10*LOG(Grunddaten!$F15)+L$11*LOG(Grunddaten!$H15)","v":{"$error":"#NUM!"}},{"$f":"M$8+M$9*LOG(Grunddaten!$G15)+M$10*LOG(Grunddaten!$F15)+M$11*LOG(Grunddaten!$H15)","v":{"$error":"#NUM!"}},{"$f":"N$8+N$9*LOG(Grunddaten!$G15)+N$10*LOG(Grunddaten!$F15)+N$11*LOG(Grunddaten!$H15)","v":{"$error":"#NUM!"}},{"$f":"O$8+O$9*LOG(Grunddaten!$G15)+O$10*LOG(Grunddaten!$F15)+O$11*LOG(Grunddaten!$H15)","v":{"$error":"#NUM!"}},{"$f":"P$8+P$9*LOG(Grunddaten!$G15)+P$10*LOG(Grunddaten!$F15)+P$11*LOG(Grunddaten!$H15)","v":{"$error":"#NUM!"}},{"$f":"Q$8+Q$9*LOG(Grunddaten!$G15)+Q$10*LOG(Grunddaten!$F15)+Q$11*LOG(Grunddaten!$H15)","v":{"$error":"#NUM!"}},{"$f":"R$8+R$9*LOG(Grunddaten!$G15)+R$10*LOG(Grunddaten!$F15)+R$11*LOG(Grunddaten!$H15)","v":{"$error":"#NUM!"}},{"$f":"S$8+S$9*LOG(Grunddaten!$G15)+S$10*LOG(Grunddaten!$F15)+S$11*LOG(Grunddaten!$H15)","v":{"$error":"#NUM!"}},{"$f":"T$8+T$9*LOG(Grunddaten!$G15)+T$10*LOG(Grunddaten!$F15)+T$11*LOG(Grunddaten!$H15)","v":{"$error":"#NUM!"}},{"$f":"U$8+U$9*LOG(Grunddaten!$G15)+U$10*LOG(Grunddaten!$F15)+U$11*LOG(Grunddaten!$H15)","v":{"$error":"#NUM!"}},{"$f":"V$8+V$9*LOG(Grunddaten!$G15)+V$10*LOG(Grunddaten!$F15)+V$11*LOG(Grunddaten!$H15)","v":{"$error":"#NUM!"}},{"$error":"#NUM!"}]
[{"$f":"Grunddaten!C16","v":"DRS180"},{"$f":"B$8+B$9*LOG(Grunddaten!$G16)+B$10*LOG(Grunddaten!$F16)+B$11*LOG(Grunddaten!$H16)","v":{"$error":"#NUM!"}},{"$f":"C$8+C$9*LOG(Grunddaten!$G16)+C$10*LOG(Grunddaten!$F16)+C$11*LOG(Grunddaten!$H16)","v":{"$error":"#NUM!"}},{"$f":"D$8+D$9*LOG(Grunddaten!$G16)+D$10*LOG(Grunddaten!$F16)+D$11*LOG(Grunddaten!$H16)","v":{"$error":"#NUM!"}},{"$f":"E$8+E$9*LOG(Grunddaten!$G16)+E$10*LOG(Grunddaten!$F16)+E$11*LOG(Grunddaten!$H16)","v":{"$error":"#NUM!"}},{"$f":"F$8+F$9*LOG(Grunddaten!$G16)+F$10*LOG(Grunddaten!$F16)+F$11*LOG(Grunddaten!$H16)","v":{"$error":"#NUM!"}},{"$f":"G$8+G$9*LOG(Grunddaten!$G16)+G$10*LOG(Grunddaten!$F16)+G$11*LOG(Grunddaten!$H16)","v":{"$error":"#NUM!"}},{"$f":"H$8+H$9*LOG(Grunddaten!$G16)+H$10*LOG(Grunddaten!$F16)+H$11*LOG(Grunddaten!$H16)","v":{"$error":"#NUM!"}},{"$f":"I$8+I$9*LOG(Grunddaten!$G16)+I$10*LOG(Grunddaten!$F16)+I$11*LOG(Grunddaten!$H16)","v":{"$error":"#NUM!"}},{"$f":"J$8+J$9*LOG(Grunddaten!$G16)+J$10*LOG(Grunddaten!$F16)+J$11*LOG(Grunddaten!$H16)","v":{"$error":"#NUM!"}},{"$f":"K$8+K$9*LOG(Grunddaten!$G16)+K$10*LOG(Grunddaten!$F16)+K$11*LOG(Grunddaten!$H16)","v":{"$error":"#NUM!"}},{"$f":"L$8+L$9*LOG(Grunddaten!$G16)+L$10*LOG(Grunddaten!$F16)+L$11*LOG(Grunddaten!$H16)","v":{"$error":"#NUM!"}},{"$f":"M$8+M$9*LOG(Grunddaten!$G16)+M$10*LOG(Grunddaten!$F16)+M$11*LOG(Grunddaten!$H16)","v":{"$error":"#NUM!"}},{"$f":"N$8+N$9*LOG(Grunddaten!$G16)+N$10*LOG(Grunddaten!$F16)+N$11*LOG(Grunddaten!$H16)","v":{"$error":"#NUM!"}},{"$f":"O$8+O$9*LOG(Grunddaten!$G16)+O$10*LOG(Grunddaten!$F16)+O$11*LOG(Grunddaten!$H16)","v":{"$error":"#NUM!"}},{"$f":"P$8+P$9*LOG(Grunddaten!$G16)+P$10*LOG(Grunddaten!$F16)+P$11*LOG(Grunddaten!$H16)","v":{"$error":"#NUM!"}},{"$f":"Q$8+Q$9*LOG(Grunddaten!$G16)+Q$10*LOG(Grunddaten!$F16)+Q$11*LOG(Grunddaten!$H16)","v":{"$error":"#NUM!"}},{"$f":"R$8+R$9*LOG(Grunddaten!$G16)+R$10*LOG(Grunddaten!$F16)+R$11*LOG(Grunddaten!$H16)","v":{"$error":"#NUM!"}},{"$f":"S$8+S$9*LOG(Grunddaten!$G16)+S$10*LOG(Grunddaten!$F16)+S$11*LOG(Grunddaten!$H16)","v":{"$error":"#NUM!"}},{"$f":"T$8+T$9*LOG(Grunddaten!$G16)+T$10*LOG(Grunddaten!$F16)+T$11*LOG(Grunddaten!$H16)","v":{"$error":"#NUM!"}},{"$f":"U$8+U$9*LOG(Grunddaten!$G16)+U$10*LOG(Grunddaten!$F16)+U$11*LOG(Grunddaten!$H16)","v":{"$error":"#NUM!"}},{"$f":"V$8+V$9*LOG(Grunddaten!$G16)+V$10*LOG(Grunddaten!$F16)+V$11*LOG(Grunddaten!$H16)","v":{"$error":"#NUM!"}},{"$error":"#NUM!"}]
[{"$f":"Grunddaten!C17","v":"DRS250"},{"$f":"B$8+B$9*LOG(Grunddaten!$G17)+B$10*LOG(Grunddaten!$F17)+B$11*LOG(Grunddaten!$H17)","v":{"$error":"#NUM!"}},{"$f":"C$8+C$9*LOG(Grunddaten!$G17)+C$10*LOG(Grunddaten!$F17)+C$11*LOG(Grunddaten!$H17)","v":{"$error":"#NUM!"}},{"$f":"D$8+D$9*LOG(Grunddaten!$G17)+D$10*LOG(Grunddaten!$F17)+D$11*LOG(Grunddaten!$H17)","v":{"$error":"#NUM!"}},{"$f":"E$8+E$9*LOG(Grunddaten!$G17)+E$10*LOG(Grunddaten!$F17)+E$11*LOG(Grunddaten!$H17)","v":{"$error":"#NUM!"}},{"$f":"F$8+F$9*LOG(Grunddaten!$G17)+F$10*LOG(Grunddaten!$F17)+F$11*LOG(Grunddaten!$H17)","v":{"$error":"#NUM!"}},{"$f":"G$8+G$9*LOG(Grunddaten!$G17)+G$10*LOG(Grunddaten!$F17)+G$11*LOG(Grunddaten!$H17)","v":{"$error":"#NUM!"}},{"$f":"H$8+H$9*LOG(Grunddaten!$G17)+H$10*LOG(Grunddaten!$F17)+H$11*LOG(Grunddaten!$H17)","v":{"$error":"#NUM!"}},{"$f":"I$8+I$9*LOG(Grunddaten!$G17)+I$10*LOG(Grunddaten!$F17)+I$11*LOG(Grunddaten!$H17)","v":{"$error":"#NUM!"}},{"$f":"J$8+J$9*LOG(Grunddaten!$G17)+J$10*LOG(Grunddaten!$F17)+J$11*LOG(Grunddaten!$H17)","v":{"$error":"#NUM!"}},{"$f":"K$8+K$9*LOG(Grunddaten!$G17)+K$10*LOG(Grunddaten!$F17)+K$11*LOG(Grunddaten!$H17)","v":{"$error":"#NUM!"}},{"$f":"L$8+L$9*LOG(Grunddaten!$G17)+L$10*LOG(Grunddaten!$F17)+L$11*LOG(Grunddaten!$H17)","v":{"$error":"#NUM!"}},{"$f":"M$8+M$9*LOG(Grunddaten!$G17)+M$10*LOG(Grunddaten!$F17)+M$11*LOG(Grunddaten!$H17)","v":{"$error":"#NUM!"}},{"$f":"N$8+N$9*LOG(Grunddaten!$G17)+N$10*LOG(Grunddaten!$F17)+N$11*LOG(Grunddaten!$H17)","v":{"$error":"#NUM!"}},{"$f":"O$8+O$9*LOG(Grunddaten!$G17)+O$10*LOG(Grunddaten!$F17)+O$11*LOG(Grunddaten!$H17)","v":{"$error":"#NUM!"}},{"$f":"P$8+P$9*LOG(Grunddaten!$G17)+P$10*LOG(Grunddaten!$F17)+P$11*LOG(Grunddaten!$H17)","v":{"$error":"#NUM!"}},{"$f":"Q$8+Q$9*LOG(Grunddaten!$G17)+Q$10*LOG(Grunddaten!$F17)+Q$11*LOG(Grunddaten!$H17)","v":{"$error":"#NUM!"}},{"$f":"R$8+R$9*LOG(Grunddaten!$G17)+R$10*LOG(Grunddaten!$F17)+R$11*LOG(Grunddaten!$H17)","v":{"$error":"#NUM!"}},{"$f":"S$8+S$9*LOG(Grunddaten!$G17)+S$10*LOG(Grunddaten!$F17)+S$11*LOG(Grunddaten!$H17)","v":{"$error":"#NUM!"}},{"$f":"T$8+T$9*LOG(Grunddaten!$G17)+T$10*LOG(Grunddaten!$F17)+T$11*LOG(Grunddaten!$H17)","v":{"$error":"#NUM!"}},{"$f":"U$8+U$9*LOG(Grunddaten!$G17)+U$10*LOG(Grunddaten!$F17)+U$11*LOG(Grunddaten!$H17)","v":{"$error":"#NUM!"}},{"$f":"V$8+V$9*LOG(Grunddaten!$G17)+V$10*LOG(Grunddaten!$F17)+V$11*LOG(Grunddaten!$H17)","v":{"$error":"#NUM!"}},{"$error":"#NUM!"}]
[{"$f":"Grunddaten!C18","v":"DRS315"},{"$f":"B$8+B$9*LOG(Grunddaten!$G18)+B$10*LOG(Grunddaten!$F18)+B$11*LOG(Grunddaten!$H18)","v":{"$error":"#NUM!"}},{"$f":"C$8+C$9*LOG(Grunddaten!$G18)+C$10*LOG(Grunddaten!$F18)+C$11*LOG(Grunddaten!$H18)","v":{"$error":"#NUM!"}},{"$f":"D$8+D$9*LOG(Grunddaten!$G18)+D$10*LOG(Grunddaten!$F18)+D$11*LOG(Grunddaten!$H18)","v":{"$error":"#NUM!"}},{"$f":"E$8+E$9*LOG(Grunddaten!$G18)+E$10*LOG(Grunddaten!$F18)+E$11*LOG(Grunddaten!$H18)","v":{"$error":"#NUM!"}},{"$f":"F$8+F$9*LOG(Grunddaten!$G18)+F$10*LOG(Grunddaten!$F18)+F$11*LOG(Grunddaten!$H18)","v":{"$error":"#NUM!"}},{"$f":"G$8+G$9*LOG(Grunddaten!$G18)+G$10*LOG(Grunddaten!$F18)+G$11*LOG(Grunddaten!$H18)","v":{"$error":"#NUM!"}},{"$f":"H$8+H$9*LOG(Grunddaten!$G18)+H$10*LOG(Grunddaten!$F18)+H$11*LOG(Grunddaten!$H18)","v":{"$error":"#NUM!"}},{"$f":"I$8+I$9*LOG(Grunddaten!$G18)+I$10*LOG(Grunddaten!$F18)+I$11*LOG(Grunddaten!$H18)","v":{"$error":"#NUM!"}},{"$f":"J$8+J$9*LOG(Grunddaten!$G18)+J$10*LOG(Grunddaten!$F18)+J$11*LOG(Grunddaten!$H18)","v":{"$error":"#NUM!"}},{"$f":"K$8+K$9*LOG(Grunddaten!$G18)+K$10*LOG(Grunddaten!$F18)+K$11*LOG(Grunddaten!$H18)","v":{"$error":"#NUM!"}},{"$f":"L$8+L$9*LOG(Grunddaten!$G18)+L$10*LOG(Grunddaten!$F18)+L$11*LOG(Grunddaten!$H18)","v":{"$error":"#NUM!"}},{"$f":"M$8+M$9*LOG(Grunddaten!$G18)+M$10*LOG(Grunddaten!$F18)+M$11*LOG(Grunddaten!$H18)","v":{"$error":"#NUM!"}},{"$f":"N$8+N$9*LOG(Grunddaten!$G18)+N$10*LOG(Grunddaten!$F18)+N$11*LOG(Grunddaten!$H18)","v":{"$error":"#NUM!"}},{"$f":"O$8+O$9*LOG(Grunddaten!$G18)+O$10*LOG(Grunddaten!$F18)+O$11*LOG(Grunddaten!$H18)","v":{"$error":"#NUM!"}},{"$f":"P$8+P$9*LOG(Grunddaten!$G18)+P$10*LOG(Grunddaten!$F18)+P$11*LOG(Grunddaten!$H18)","v":{"$error":"#NUM!"}},{"$f":"Q$8+Q$9*LOG(Grunddaten!$G18)+Q$10*LOG(Grunddaten!$F18)+Q$11*LOG(Grunddaten!$H18)","v":{"$error":"#NUM!"}},{"$f":"R$8+R$9*LOG(Grunddaten!$G18)+R$10*LOG(Grunddaten!$F18)+R$11*LOG(Grunddaten!$H18)","v":{"$error":"#NUM!"}},{"$f":"S$8+S$9*LOG(Grunddaten!$G18)+S$10*LOG(Grunddaten!$F18)+S$11*LOG(Grunddaten!$H18)","v":{"$error":"#NUM!"}},{"$f":"T$8+T$9*LOG(Grunddaten!$G18)+T$10*LOG(Grunddaten!$F18)+T$11*LOG(Grunddaten!$H18)","v":{"$error":"#NUM!"}},{"$f":"U$8+U$9*LOG(Grunddaten!$G18)+U$10*LOG(Grunddaten!$F18)+U$11*LOG(Grunddaten!$H18)","v":{"$error":"#NUM!"}},{"$f":"V$8+V$9*LOG(Grunddaten!$G18)+V$10*LOG(Grunddaten!$F18)+V$11*LOG(Grunddaten!$H18)","v":{"$error":"#NUM!"}},{"$error":"#NUM!"}]
[{"$f":"Grunddaten!C19","v":"DRS355"},{"$f":"B$8+B$9*LOG(Grunddaten!$G19)+B$10*LOG(Grunddaten!$F19)+B$11*LOG(Grunddaten!$H19)","v":{"$error":"#NUM!"}},{"$f":"C$8+C$9*LOG(Grunddaten!$G19)+C$10*LOG(Grunddaten!$F19)+C$11*LOG(Grunddaten!$H19)","v":{"$error":"#NUM!"}},{"$f":"D$8+D$9*LOG(Grunddaten!$G19)+D$10*LOG(Grunddaten!$F19)+D$11*LOG(Grunddaten!$H19)","v":{"$error":"#NUM!"}},{"$f":"E$8+E$9*LOG(Grunddaten!$G19)+E$10*LOG(Grunddaten!$F19)+E$11*LOG(Grunddaten!$H19)","v":{"$error":"#NUM!"}},{"$f":"F$8+F$9*LOG(Grunddaten!$G19)+F$10*LOG(Grunddaten!$F19)+F$11*LOG(Grunddaten!$H19)","v":{"$error":"#NUM!"}},{"$f":"G$8+G$9*LOG(Grunddaten!$G19)+G$10*LOG(Grunddaten!$F19)+G$11*LOG(Grunddaten!$H19)","v":{"$error":"#NUM!"}},{"$f":"H$8+H$9*LOG(Grunddaten!$G19)+H$10*LOG(Grunddaten!$F19)+H$11*LOG(Grunddaten!$H19)","v":{"$error":"#NUM!"}},{"$f":"I$8+I$9*LOG(Grunddaten!$G19)+I$10*LOG(Grunddaten!$F19)+I$11*LOG(Grunddaten!$H19)","v":{"$error":"#NUM!"}},{"$f":"J$8+J$9*LOG(Grunddaten!$G19)+J$10*LOG(Grunddaten!$F19)+J$11*LOG(Grunddaten!$H19)","v":{"$error":"#NUM!"}},{"$f":"K$8+K$9*LOG(Grunddaten!$G19)+K$10*LOG(Grunddaten!$F19)+K$11*LOG(Grunddaten!$H19)","v":{"$error":"#NUM!"}},{"$f":"L$8+L$9*LOG(Grunddaten!$G19)+L$10*LOG(Grunddaten!$F19)+L$11*LOG(Grunddaten!$H19)","v":{"$error":"#NUM!"}},{"$f":"M$8+M$9*LOG(Grunddaten!$G19)+M$10*LOG(Grunddaten!$F19)+M$11*LOG(Grunddaten!$H19)","v":{"$error":"#NUM!"}},{"$f":"N$8+N$9*LOG(Grunddaten!$G19)+N$10*LOG(Grunddaten!$F19)+N$11*LOG(Grunddaten!$H19)","v":{"$error":"#NUM!"}},{"$f":"O$8+O$9*LOG(Grunddaten!$G19)+O$10*LOG(Grunddaten!$F19)+O$11*LOG(Grunddaten!$H19)","v":{"$error":"#NUM!"}},{"$f":"P$8+P$9*LOG(Grunddaten!$G19)+P$10*LOG(Grunddaten!$F19)+P$11*LOG(Grunddaten!$H19)","v":{"$error":"#NUM!"}},{"$f":"Q$8+Q$9*LOG(Grunddaten!$G19)+Q$10*LOG(Grunddaten!$F19)+Q$11*LOG(Grunddaten!$H19)","v":{"$error":"#NUM!"}},{"$f":"R$8+R$9*LOG(Grunddaten!$G19)+R$10*LOG(Grunddaten!$F19)+R$11*LOG(Grunddaten!$H19)","v":{"$error":"#NUM!"}},{"$f":"S$8+S$9*LOG(Grunddaten!$G19)+S$10*LOG(Grunddaten!$F19)+S$11*LOG(Grunddaten!$H19)","v":{"$error":"#NUM!"}},{"$f":"T$8+T$9*LOG(Grunddaten!$G19)+T$10*LOG(Grunddaten!$F19)+T$11*LOG(Grunddaten!$H19)","v":{"$error":"#NUM!"}},{"$f":"U$8+U$9*LOG(Grunddaten!$G19)+U$10*LOG(Grunddaten!$F19)+U$11*LOG(Grunddaten!$H19)","v":{"$error":"#NUM!"}},{"$f":"V$8+V$9*LOG(Grunddaten!$G19)+V$10*LOG(Grunddaten!$F19)+V$11*LOG(Grunddaten!$H19)","v":{"$error":"#NUM!"}},{"$error":"#NUM!"}]
[{"$f":"Grunddaten!C20","v":"100"},{"$f":"B$8+B$9*LOG(Grunddaten!$G20)+B$10*LOG(Grunddaten!$F20)+B$11*LOG(Grunddaten!$H20)","v":{"$error":"#NUM!"}},{"$f":"C$8+C$9*LOG(Grunddaten!$G20)+C$10*LOG(Grunddaten!$F20)+C$11*LOG(Grunddaten!$H20)","v":{"$error":"#NUM!"}},{"$f":"D$8+D$9*LOG(Grunddaten!$G20)+D$10*LOG(Grunddaten!$F20)+D$11*LOG(Grunddaten!$H20)","v":{"$error":"#NUM!"}},{"$f":"E$8+E$9*LOG(Grunddaten!$G20)+E$10*LOG(Grunddaten!$F20)+E$11*LOG(Grunddaten!$H20)","v":{"$error":"#NUM!"}},{"$f":"F$8+F$9*LOG(Grunddaten!$G20)+F$10*LOG(Grunddaten!$F20)+F$11*LOG(Grunddaten!$H20)","v":{"$error":"#NUM!"}},{"$f":"G$8+G$9*LOG(Grunddaten!$G20)+G$10*LOG(Grunddaten!$F20)+G$11*LOG(Grunddaten!$H20)","v":{"$error":"#NUM!"}},{"$f":"H$8+H$9*LOG(Grunddaten!$G20)+H$10*LOG(Grunddaten!$F20)+H$11*LOG(Grunddaten!$H20)","v":{"$error":"#NUM!"}},{"$f":"I$8+I$9*LOG(Grunddaten!$G20)+I$10*LOG(Grunddaten!$F20)+I$11*LOG(Grunddaten!$H20)","v":{"$error":"#NUM!"}},{"$f":"J$8+J$9*LOG(Grunddaten!$G20)+J$10*LOG(Grunddaten!$F20)+J$11*LOG(Grunddaten!$H20)","v":{"$error":"#NUM!"}},{"$f":"K$8+K$9*LOG(Grunddaten!$G20)+K$10*LOG(Grunddaten!$F20)+K$11*LOG(Grunddaten!$H20)","v":{"$error":"#NUM!"}},{"$f":"L$8+L$9*LOG(Grunddaten!$G20)+L$10*LOG(Grunddaten!$F20)+L$11*LOG(Grunddaten!$H20)","v":{"$error":"#NUM!"}},{"$f":"M$8+M$9*LOG(Grunddaten!$G20)+M$10*LOG(Grunddaten!$F20)+M$11*LOG(Grunddaten!$H20)","v":{"$error":"#NUM!"}},{"$f":"N$8+N$9*LOG(Grunddaten!$G20)+N$10*LOG(Grunddaten!$F20)+N$11*LOG(Grunddaten!$H20)","v":{"$error":"#NUM!"}},{"$f":"O$8+O$9*LOG(Grunddaten!$G20)+O$10*LOG(Grunddaten!$F20)+O$11*LOG(Grunddaten!$H20)","v":{"$error":"#NUM!"}},{"$f":"P$8+P$9*LOG(Grunddaten!$G20)+P$10*LOG(Grunddaten!$F20)+P$11*LOG(Grunddaten!$H20)","v":{"$error":"#NUM!"}},{"$f":"Q$8+Q$9*LOG(Grunddaten!$G20)+Q$10*LOG(Grunddaten!$F20)+Q$11*LOG(Grunddaten!$H20)","v":{"$error":"#NUM!"}},{"$f":"R$8+R$9*LOG(Grunddaten!$G20)+R$10*LOG(Grunddaten!$F20)+R$11*LOG(Grunddaten!$H20)","v":{"$error":"#NUM!"}},{"$f":"S$8+S$9*LOG(Grunddaten!$G20)+S$10*LOG(Grunddaten!$F20)+S$11*LOG(Grunddaten!$H20)","v":{"$error":"#NUM!"}},{"$f":"T$8+T$9*LOG(Grunddaten!$G20)+T$10*LOG(Grunddaten!$F20)+T$11*LOG(Grunddaten!$H20)","v":{"$error":"#NUM!"}},{"$f":"U$8+U$9*LOG(Grunddaten!$G20)+U$10*LOG(Grunddaten!$F20)+U$11*LOG(Grunddaten!$H20)","v":{"$error":"#NUM!"}},{"$f":"V$8+V$9*LOG(Grunddaten!$G20)+V$10*LOG(Grunddaten!$F20)+V$11*LOG(Grunddaten!$H20)","v":{"$error":"#NUM!"}},{"$error":"#NUM!"}]
[{"$f":"Grunddaten!C21","v":"125"},{"$f":"B$8+B$9*LOG(Grunddaten!$G21)+B$10*LOG(Grunddaten!$F21)+B$11*LOG(Grunddaten!$H21)","v":{"$error":"#NUM!"}},{"$f":"C$8+C$9*LOG(Grunddaten!$G21)+C$10*LOG(Grunddaten!$F21)+C$11*LOG(Grunddaten!$H21)","v":{"$error":"#NUM!"}},{"$f":"D$8+D$9*LOG(Grunddaten!$G21)+D$10*LOG(Grunddaten!$F21)+D$11*LOG(Grunddaten!$H21)","v":{"$error":"#NUM!"}},{"$f":"E$8+E$9*LOG(Grunddaten!$G21)+E$10*LOG(Grunddaten!$F21)+E$11*LOG(Grunddaten!$H21)","v":{"$error":"#NUM!"}},{"$f":"F$8+F$9*LOG(Grunddaten!$G21)+F$10*LOG(Grunddaten!$F21)+F$11*LOG(Grunddaten!$H21)","v":{"$error":"#NUM!"}},{"$f":"G$8+G$9*LOG(Grunddaten!$G21)+G$10*LOG(Grunddaten!$F21)+G$11*LOG(Grunddaten!$H21)","v":{"$error":"#NUM!"}},{"$f":"H$8+H$9*LOG(Grunddaten!$G21)+H$10*LOG(Grunddaten!$F21)+H$11*LOG(Grunddaten!$H21)","v":{"$error":"#NUM!"}},{"$f":"I$8+I$9*LOG(Grunddaten!$G21)+I$10*LOG(Grunddaten!$F21)+I$11*LOG(Grunddaten!$H21)","v":{"$error":"#NUM!"}},{"$f":"J$8+J$9*LOG(Grunddaten!$G21)+J$10*LOG(Grunddaten!$F21)+J$11*LOG(Grunddaten!$H21)","v":{"$error":"#NUM!"}},{"$f":"K$8+K$9*LOG(Grunddaten!$G21)+K$10*LOG(Grunddaten!$F21)+K$11*LOG(Grunddaten!$H21)","v":{"$error":"#NUM!"}},{"$f":"L$8+L$9*LOG(Grunddaten!$G21)+L$10*LOG(Grunddaten!$F21)+L$11*LOG(Grunddaten!$H21)","v":{"$error":"#NUM!"}},{"$f":"M$8+M$9*LOG(Grunddaten!$G21)+M$10*LOG(Grunddaten!$F21)+M$11*LOG(Grunddaten!$H21)","v":{"$error":"#NUM!"}},{"$f":"N$8+N$9*LOG(Grunddaten!$G21)+N$10*LOG(Grunddaten!$F21)+N$11*LOG(Grunddaten!$H21)","v":{"$error":"#NUM!"}},{"$f":"O$8+O$9*LOG(Grunddaten!$G21)+O$10*LOG(Grunddaten!$F21)+O$11*LOG(Grunddaten!$H21)","v":{"$error":"#NUM!"}},{"$f":"P$8+P$9*LOG(Grunddaten!$G21)+P$10*LOG(Grunddaten!$F21)+P$11*LOG(Grunddaten!$H21)","v":{"$error":"#NUM!"}},{"$f":"Q$8+Q$9*LOG(Grunddaten!$G21)+Q$10*LOG(Grunddaten!$F21)+Q$11*LOG(Grunddaten!$H21)","v":{"$error":"#NUM!"}},{"$f":"R$8+R$9*LOG(Grunddaten!$G21)+R$10*LOG(Grunddaten!$F21)+R$11*LOG(Grunddaten!$H21)","v":{"$error":"#NUM!"}},{"$f":"S$8+S$9*LOG(Grunddaten!$G21)+S$10*LOG(Grunddaten!$F21)+S$11*LOG(Grunddaten!$H21)","v":{"$error":"#NUM!"}},{"$f":"T$8+T$9*LOG(Grunddaten!$G21)+T$10*LOG(Grunddaten!$F21)+T$11*LOG(Grunddaten!$H21)","v":{"$error":"#NUM!"}},{"$f":"U$8+U$9*LOG(Grunddaten!$G21)+U$10*LOG(Grunddaten!$F21)+U$11*LOG(Grunddaten!$H21)","v":{"$error":"#NUM!"}},{"$f":"V$8+V$9*LOG(Grunddaten!$G21)+V$10*LOG(Grunddaten!$F21)+V$11*LOG(Grunddaten!$H21)","v":{"$error":"#NUM!"}},{"$error":"#NUM!"}]
[{"$f":"Grunddaten!C22","v":"180"},{"$f":"B$8+B$9*LOG(Grunddaten!$G22)+B$10*LOG(Grunddaten!$F22)+B$11*LOG(Grunddaten!$H22)","v":{"$error":"#NUM!"}},{"$f":"C$8+C$9*LOG(Grunddaten!$G22)+C$10*LOG(Grunddaten!$F22)+C$11*LOG(Grunddaten!$H22)","v":{"$error":"#NUM!"}},{"$f":"D$8+D$9*LOG(Grunddaten!$G22)+D$10*LOG(Grunddaten!$F22)+D$11*LOG(Grunddaten!$H22)","v":{"$error":"#NUM!"}},{"$f":"E$8+E$9*LOG(Grunddaten!$G22)+E$10*LOG(Grunddaten!$F22)+E$11*LOG(Grunddaten!$H22)","v":{"$error":"#NUM!"}},{"$f":"F$8+F$9*LOG(Grunddaten!$G22)+F$10*LOG(Grunddaten!$F22)+F$11*LOG(Grunddaten!$H22)","v":{"$error":"#NUM!"}},{"$f":"G$8+G$9*LOG(Grunddaten!$G22)+G$10*LOG(Grunddaten!$F22)+G$11*LOG(Grunddaten!$H22)","v":{"$error":"#NUM!"}},{"$f":"H$8+H$9*LOG(Grunddaten!$G22)+H$10*LOG(Grunddaten!$F22)+H$11*LOG(Grunddaten!$H22)","v":{"$error":"#NUM!"}},{"$f":"I$8+I$9*LOG(Grunddaten!$G22)+I$10*LOG(Grunddaten!$F22)+I$11*LOG(Grunddaten!$H22)","v":{"$error":"#NUM!"}},{"$f":"J$8+J$9*LOG(Grunddaten!$G22)+J$10*LOG(Grunddaten!$F22)+J$11*LOG(Grunddaten!$H22)","v":{"$error":"#NUM!"}},{"$f":"K$8+K$9*LOG(Grunddaten!$G22)+K$10*LOG(Grunddaten!$F22)+K$11*LOG(Grunddaten!$H22)","v":{"$error":"#NUM!"}},{"$f":"L$8+L$9*LOG(Grunddaten!$G22)+L$10*LOG(Grunddaten!$F22)+L$11*LOG(Grunddaten!$H22)","v":{"$error":"#NUM!"}},{"$f":"M$8+M$9*LOG(Grunddaten!$G22)+M$10*LOG(Grunddaten!$F22)+M$11*LOG(Grunddaten!$H22)","v":{"$error":"#NUM!"}},{"$f":"N$8+N$9*LOG(Grunddaten!$G22)+N$10*LOG(Grunddaten!$F22)+N$11*LOG(Grunddaten!$H22)","v":{"$error":"#NUM!"}},{"$f":"O$8+O$9*LOG(Grunddaten!$G22)+O$10*LOG(Grunddaten!$F22)+O$11*LOG(Grunddaten!$H22)","v":{"$error":"#NUM!"}},{"$f":"P$8+P$9*LOG(Grunddaten!$G22)+P$10*LOG(Grunddaten!$F22)+P$11*LOG(Grunddaten!$H22)","v":{"$error":"#NUM!"}},{"$f":"Q$8+Q$9*LOG(Grunddaten!$G22)+Q$10*LOG(Grunddaten!$F22)+Q$11*LOG(Grunddaten!$H22)","v":{"$error":"#NUM!"}},{"$f":"R$8+R$9*LOG(Grunddaten!$G22)+R$10*LOG(Grunddaten!$F22)+R$11*LOG(Grunddaten!$H22)","v":{"$error":"#NUM!"}},{"$f":"S$8+S$9*LOG(Grunddaten!$G22)+S$10*LOG(Grunddaten!$F22)+S$11*LOG(Grunddaten!$H22)","v":{"$error":"#NUM!"}},{"$f":"T$8+T$9*LOG(Grunddaten!$G22)+T$10*LOG(Grunddaten!$F22)+T$11*LOG(Grunddaten!$H22)","v":{"$error":"#NUM!"}},{"$f":"U$8+U$9*LOG(Grunddaten!$G22)+U$10*LOG(Grunddaten!$F22)+U$11*LOG(Grunddaten!$H22)","v":{"$error":"#NUM!"}},{"$f":"V$8+V$9*LOG(Grunddaten!$G22)+V$10*LOG(Grunddaten!$F22)+V$11*LOG(Grunddaten!$H22)","v":{"$error":"#NUM!"}},{"$error":"#NUM!"}]
[{"$f":"Grunddaten!C23","v":"250"},{"$f":"B$8+B$9*LOG(Grunddaten!$G23)+B$10*LOG(Grunddaten!$F23)+B$11*LOG(Grunddaten!$H23)","v":{"$error":"#NUM!"}},{"$f":"C$8+C$9*LOG(Grunddaten!$G23)+C$10*LOG(Grunddaten!$F23)+C$11*LOG(Grunddaten!$H23)","v":{"$error":"#NUM!"}},{"$f":"D$8+D$9*LOG(Grunddaten!$G23)+D$10*LOG(Grunddaten!$F23)+D$11*LOG(Grunddaten!$H23)","v":{"$error":"#NUM!"}},{"$f":"E$8+E$9*LOG(Grunddaten!$G23)+E$10*LOG(Grunddaten!$F23)+E$11*LOG(Grunddaten!$H23)","v":{"$error":"#NUM!"}},{"$f":"F$8+F$9*LOG(Grunddaten!$G23)+F$10*LOG(Grunddaten!$F23)+F$11*LOG(Grunddaten!$H23)","v":{"$error":"#NUM!"}},{"$f":"G$8+G$9*LOG(Grunddaten!$G23)+G$10*LOG(Grunddaten!$F23)+G$11*LOG(Grunddaten!$H23)","v":{"$error":"#NUM!"}},{"$f":"H$8+H$9*LOG(Grunddaten!$G23)+H$10*LOG(Grunddaten!$F23)+H$11*LOG(Grunddaten!$H23)","v":{"$error":"#NUM!"}},{"$f":"I$8+I$9*LOG(Grunddaten!$G23)+I$10*LOG(Grunddaten!$F23)+I$11*LOG(Grunddaten!$H23)","v":{"$error":"#NUM!"}},{"$f":"J$8+J$9*LOG(Grunddaten!$G23)+J$10*LOG(Grunddaten!$F23)+J$11*LOG(Grunddaten!$H23)","v":{"$error":"#NUM!"}},{"$f":"K$8+K$9*LOG(Grunddaten!$G23)+K$10*LOG(Grunddaten!$F23)+K$11*LOG(Grunddaten!$H23)","v":{"$error":"#NUM!"}},{"$f":"L$8+L$9*LOG(Grunddaten!$G23)+L$10*LOG(Grunddaten!$F23)+L$11*LOG(Grunddaten!$H23)","v":{"$error":"#NUM!"}},{"$f":"M$8+M$9*LOG(Grunddaten!$G23)+M$10*LOG(Grunddaten!$F23)+M$11*LOG(Grunddaten!$H23)","v":{"$error":"#NUM!"}},{"$f":"N$8+N$9*LOG(Grunddaten!$G23)+N$10*LOG(Grunddaten!$F23)+N$11*LOG(Grunddaten!$H23)","v":{"$error":"#NUM!"}},{"$f":"O$8+O$9*LOG(Grunddaten!$G23)+O$10*LOG(Grunddaten!$F23)+O$11*LOG(Grunddaten!$H23)","v":{"$error":"#NUM!"}},{"$f":"P$8+P$9*LOG(Grunddaten!$G23)+P$10*LOG(Grunddaten!$F23)+P$11*LOG(Grunddaten!$H23)","v":{"$error":"#NUM!"}},{"$f":"Q$8+Q$9*LOG(Grunddaten!$G23)+Q$10*LOG(Grunddaten!$F23)+Q$11*LOG(Grunddaten!$H23)","v":{"$error":"#NUM!"}},{"$f":"R$8+R$9*LOG(Grunddaten!$G23)+R$10*LOG(Grunddaten!$F23)+R$11*LOG(Grunddaten!$H23)","v":{"$error":"#NUM!"}},{"$f":"S$8+S$9*LOG(Grunddaten!$G23)+S$10*LOG(Grunddaten!$F23)+S$11*LOG(Grunddaten!$H23)","v":{"$error":"#NUM!"}},{"$f":"T$8+T$9*LOG(Grunddaten!$G23)+T$10*LOG(Grunddaten!$F23)+T$11*LOG(Grunddaten!$H23)","v":{"$error":"#NUM!"}},{"$f":"U$8+U$9*LOG(Grunddaten!$G23)+U$10*LOG(Grunddaten!$F23)+U$11*LOG(Grunddaten!$H23)","v":{"$error":"#NUM!"}},{"$f":"V$8+V$9*LOG(Grunddaten!$G23)+V$10*LOG(Grunddaten!$F23)+V$11*LOG(Grunddaten!$H23)","v":{"$error":"#NUM!"}},{"$error":"#NUM!"}]
[{"$f":"Grunddaten!C24","v":"315"},{"$f":"B$8+B$9*LOG(Grunddaten!$G24)+B$10*LOG(Grunddaten!$F24)+B$11*LOG(Grunddaten!$H24)","v":{"$error":"#NUM!"}},{"$f":"C$8+C$9*LOG(Grunddaten!$G24)+C$10*LOG(Grunddaten!$F24)+C$11*LOG(Grunddaten!$H24)","v":{"$error":"#NUM!"}},{"$f":"D$8+D$9*LOG(Grunddaten!$G24)+D$10*LOG(Grunddaten!$F24)+D$11*LOG(Grunddaten!$H24)","v":{"$error":"#NUM!"}},{"$f":"E$8+E$9*LOG(Grunddaten!$G24)+E$10*LOG(Grunddaten!$F24)+E$11*LOG(Grunddaten!$H24)","v":{"$error":"#NUM!"}},{"$f":"F$8+F$9*LOG(Grunddaten!$G24)+F$10*LOG(Grunddaten!$F24)+F$11*LOG(Grunddaten!$H24)","v":{"$error":"#NUM!"}},{"$f":"G$8+G$9*LOG(Grunddaten!$G24)+G$10*LOG(Grunddaten!$F24)+G$11*LOG(Grunddaten!$H24)","v":{"$error":"#NUM!"}},{"$f":"H$8+H$9*LOG(Grunddaten!$G24)+H$10*LOG(Grunddaten!$F24)+H$11*LOG(Grunddaten!$H24)","v":{"$error":"#NUM!"}},{"$f":"I$8+I$9*LOG(Grunddaten!$G24)+I$10*LOG(Grunddaten!$F24)+I$11*LOG(Grunddaten!$H24)","v":{"$error":"#NUM!"}},{"$f":"J$8+J$9*LOG(Grunddaten!$G24)+J$10*LOG(Grunddaten!$F24)+J$11*LOG(Grunddaten!$H24)","v":{"$error":"#NUM!"}},{"$f":"K$8+K$9*LOG(Grunddaten!$G24)+K$10*LOG(Grunddaten!$F24)+K$11*LOG(Grunddaten!$H24)","v":{"$error":"#NUM!"}},{"$f":"L$8+L$9*LOG(Grunddaten!$G24)+L$10*LOG(Grunddaten!$F24)+L$11*LOG(Grunddaten!$H24)","v":{"$error":"#NUM!"}},{"$f":"M$8+M$9*LOG(Grunddaten!$G24)+M$10*LOG(Grunddaten!$F24)+M$11*LOG(Grunddaten!$H24)","v":{"$error":"#NUM!"}},{"$f":"N$8+N$9*LOG(Grunddaten!$G24)+N$10*LOG(Grunddaten!$F24)+N$11*LOG(Grunddaten!$H24)","v":{"$error":"#NUM!"}},{"$f":"O$8+O$9*LOG(Grunddaten!$G24)+O$10*LOG(Grunddaten!$F24)+O$11*LOG(Grunddaten!$H24)","v":{"$error":"#NUM!"}},{"$f":"P$8+P$9*LOG(Grunddaten!$G24)+P$10*LOG(Grunddaten!$F24)+P$11*LOG(Grunddaten!$H24)","v":{"$error":"#NUM!"}},{"$f":"Q$8+Q$9*LOG(Grunddaten!$G24)+Q$10*LOG(Grunddaten!$F24)+Q$11*LOG(Grunddaten!$H24)","v":{"$error":"#NUM!"}},{"$f":"R$8+R$9*LOG(Grunddaten!$G24)+R$10*LOG(Grunddaten!$F24)+R$11*LOG(Grunddaten!$H24)","v":{"$error":"#NUM!"}},{"$f":"S$8+S$9*LOG(Grunddaten!$G24)+S$10*LOG(Grunddaten!$F24)+S$11*LOG(Grunddaten!$H24)","v":{"$error":"#NUM!"}},{"$f":"T$8+T$9*LOG(Grunddaten!$G24)+T$10*LOG(Grunddaten!$F24)+T$11*LOG(Grunddaten!$H24)","v":{"$error":"#NUM!"}},{"$f":"U$8+U$9*LOG(Grunddaten!$G24)+U$10*LOG(Grunddaten!$F24)+U$11*LOG(Grunddaten!$H24)","v":{"$error":"#NUM!"}},{"$f":"V$8+V$9*LOG(Grunddaten!$G24)+V$10*LOG(Grunddaten!$F24)+V$11*LOG(Grunddaten!$H24)","v":{"$error":"#NUM!"}},{"$error":"#NUM!"}]
[{"$f":"Grunddaten!C25","v":"355"},{"$f":"B$8+B$9*LOG(Grunddaten!$G25)+B$10*LOG(Grunddaten!$F25)+B$11*LOG(Grunddaten!$H25)","v":{"$error":"#NUM!"}},{"$f":"C$8+C$9*LOG(Grunddaten!$G25)+C$10*LOG(Grunddaten!$F25)+C$11*LOG(Grunddaten!$H25)","v":{"$error":"#NUM!"}},{"$f":"D$8+D$9*LOG(Grunddaten!$G25)+D$10*LOG(Grunddaten!$F25)+D$11*LOG(Grunddaten!$H25)","v":{"$error":"#NUM!"}},{"$f":"E$8+E$9*LOG(Grunddaten!$G25)+E$10*LOG(Grunddaten!$F25)+E$11*LOG(Grunddaten!$H25)","v":{"$error":"#NUM!"}},{"$f":"F$8+F$9*LOG(Grunddaten!$G25)+F$10*LOG(Grunddaten!$F25)+F$11*LOG(Grunddaten!$H25)","v":{"$error":"#NUM!"}},{"$f":"G$8+G$9*LOG(Grunddaten!$G25)+G$10*LOG(Grunddaten!$F25)+G$11*LOG(Grunddaten!$H25)","v":{"$error":"#NUM!"}},{"$f":"H$8+H$9*LOG(Grunddaten!$G25)+H$10*LOG(Grunddaten!$F25)+H$11*LOG(Grunddaten!$H25)","v":{"$error":"#NUM!"}},{"$f":"I$8+I$9*LOG(Grunddaten!$G25)+I$10*LOG(Grunddaten!$F25)+I$11*LOG(Grunddaten!$H25)","v":{"$error":"#NUM!"}},{"$f":"J$8+J$9*LOG(Grunddaten!$G25)+J$10*LOG(Grunddaten!$F25)+J$11*LOG(Grunddaten!$H25)","v":{"$error":"#NUM!"}},{"$f":"K$8+K$9*LOG(Grunddaten!$G25)+K$10*LOG(Grunddaten!$F25)+K$11*LOG(Grunddaten!$H25)","v":{"$error":"#NUM!"}},{"$f":"L$8+L$9*LOG(Grunddaten!$G25)+L$10*LOG(Grunddaten!$F25)+L$11*LOG(Grunddaten!$H25)","v":{"$error":"#NUM!"}},{"$f":"M$8+M$9*LOG(Grunddaten!$G25)+M$10*LOG(Grunddaten!$F25)+M$11*LOG(Grunddaten!$H25)","v":{"$error":"#NUM!"}},{"$f":"N$8+N$9*LOG(Grunddaten!$G25)+N$10*LOG(Grunddaten!$F25)+N$11*LOG(Grunddaten!$H25)","v":{"$error":"#NUM!"}},{"$f":"O$8+O$9*LOG(Grunddaten!$G25)+O$10*LOG(Grunddaten!$F25)+O$11*LOG(Grunddaten!$H25)","v":{"$error":"#NUM!"}},{"$f":"P$8+P$9*LOG(Grunddaten!$G25)+P$10*LOG(Grunddaten!$F25)+P$11*LOG(Grunddaten!$H25)","v":{"$error":"#NUM!"}},{"$f":"Q$8+Q$9*LOG(Grunddaten!$G25)+Q$10*LOG(Grunddaten!$F25)+Q$11*LOG(Grunddaten!$H25)","v":{"$error":"#NUM!"}},{"$f":"R$8+R$9*LOG(Grunddaten!$G25)+R$10*LOG(Grunddaten!$F25)+R$11*LOG(Grunddaten!$H25)","v":{"$error":"#NUM!"}},{"$f":"S$8+S$9*LOG(Grunddaten!$G25)+S$10*LOG(Grunddaten!$F25)+S$11*LOG(Grunddaten!$H25)","v":{"$error":"#NUM!"}},{"$f":"T$8+T$9*LOG(Grunddaten!$G25)+T$10*LOG(Grunddaten!$F25)+T$11*LOG(Grunddaten!$H25)","v":{"$error":"#NUM!"}},{"$f":"U$8+U$9*LOG(Grunddaten!$G25)+U$10*LOG(Grunddaten!$F25)+U$11*LOG(Grunddaten!$H25)","v":{"$error":"#NUM!"}},{"$f":"V$8+V$9*LOG(Grunddaten!$G25)+V$10*LOG(Grunddaten!$F25)+V$11*LOG(Grunddaten!$H25)","v":{"$error":"#NUM!"}},{"$error":"#NUM!"}]
[{"$f":"Grunddaten!C26","v":"MSA300"},{"$f":"B$8+B$9*LOG(Grunddaten!$G26)+B$10*LOG(Grunddaten!$F26)+B$11*LOG(Grunddaten!$H26)","v":{"$error":"#NUM!"}},{"$f":"C$8+C$9*LOG(Grunddaten!$G26)+C$10*LOG(Grunddaten!$F26)+C$11*LOG(Grunddaten!$H26)","v":{"$error":"#NUM!"}},{"$f":"D$8+D$9*LOG(Grunddaten!$G26)+D$10*LOG(Grunddaten!$F26)+D$11*LOG(Grunddaten!$H26)","v":{"$error":"#NUM!"}},{"$f":"E$8+E$9*LOG(Grunddaten!$G26)+E$10*LOG(Grunddaten!$F26)+E$11*LOG(Grunddaten!$H26)","v":{"$error":"#NUM!"}},{"$f":"F$8+F$9*LOG(Grunddaten!$G26)+F$10*LOG(Grunddaten!$F26)+F$11*LOG(Grunddaten!$H26)","v":{"$error":"#NUM!"}},{"$f":"G$8+G$9*LOG(Grunddaten!$G26)+G$10*LOG(Grunddaten!$F26)+G$11*LOG(Grunddaten!$H26)","v":{"$error":"#NUM!"}},{"$f":"H$8+H$9*LOG(Grunddaten!$G26)+H$10*LOG(Grunddaten!$F26)+H$11*LOG(Grunddaten!$H26)","v":{"$error":"#NUM!"}},{"$f":"I$8+I$9*LOG(Grunddaten!$G26)+I$10*LOG(Grunddaten!$F26)+I$11*LOG(Grunddaten!$H26)","v":{"$error":"#NUM!"}},{"$f":"J$8+J$9*LOG(Grunddaten!$G26)+J$10*LOG(Grunddaten!$F26)+J$11*LOG(Grunddaten!$H26)","v":{"$error":"#NUM!"}},{"$f":"K$8+K$9*LOG(Grunddaten!$G26)+K$10*LOG(Grunddaten!$F26)+K$11*LOG(Grunddaten!$H26)","v":{"$error":"#NUM!"}},{"$f":"L$8+L$9*LOG(Grunddaten!$G26)+L$10*LOG(Grunddaten!$F26)+L$11*LOG(Grunddaten!$H26)","v":{"$error":"#NUM!"}},{"$f":"M$8+M$9*LOG(Grunddaten!$G26)+M$10*LOG(Grunddaten!$F26)+M$11*LOG(Grunddaten!$H26)","v":{"$error":"#NUM!"}},{"$f":"N$8+N$9*LOG(Grunddaten!$G26)+N$10*LOG(Grunddaten!$F26)+N$11*LOG(Grunddaten!$H26)","v":{"$error":"#NUM!"}},{"$f":"O$8+O$9*LOG(Grunddaten!$G26)+O$10*LOG(Grunddaten!$F26)+O$11*LOG(Grunddaten!$H26)","v":{"$error":"#NUM!"}},{"$f":"P$8+P$9*LOG(Grunddaten!$G26)+P$10*LOG(Grunddaten!$F26)+P$11*LOG(Grunddaten!$H26)","v":{"$error":"#NUM!"}},{"$f":"Q$8+Q$9*LOG(Grunddaten!$G26)+Q$10*LOG(Grunddaten!$F26)+Q$11*LOG(Grunddaten!$H26)","v":{"$error":"#NUM!"}},{"$f":"R$8+R$9*LOG(Grunddaten!$G26)+R$10*LOG(Grunddaten!$F26)+R$11*LOG(Grunddaten!$H26)","v":{"$error":"#NUM!"}},{"$f":"S$8+S$9*LOG(Grunddaten!$G26)+S$10*LOG(Grunddaten!$F26)+S$11*LOG(Grunddaten!$H26)","v":{"$error":"#NUM!"}},{"$f":"T$8+T$9*LOG(Grunddaten!$G26)+T$10*LOG(Grunddaten!$F26)+T$11*LOG(Grunddaten!$H26)","v":{"$error":"#NUM!"}},{"$f":"U$8+U$9*LOG(Grunddaten!$G26)+U$10*LOG(Grunddaten!$F26)+U$11*LOG(Grunddaten!$H26)","v":{"$error":"#NUM!"}},{"$f":"V$8+V$9*LOG(Grunddaten!$G26)+V$10*LOG(Grunddaten!$F26)+V$11*LOG(Grunddaten!$H26)","v":{"$error":"#NUM!"}},{"$error":"#NUM!"}]
[{"$f":"Grunddaten!C27","v":"MSA400"},{"$f":"B$8+B$9*LOG(Grunddaten!$G27)+B$10*LOG(Grunddaten!$F27)+B$11*LOG(Grunddaten!$H27)","v":{"$error":"#NUM!"}},{"$f":"C$8+C$9*LOG(Grunddaten!$G27)+C$10*LOG(Grunddaten!$F27)+C$11*LOG(Grunddaten!$H27)","v":{"$error":"#NUM!"}},{"$f":"D$8+D$9*LOG(Grunddaten!$G27)+D$10*LOG(Grunddaten!$F27)+D$11*LOG(Grunddaten!$H27)","v":{"$error":"#NUM!"}},{"$f":"E$8+E$9*LOG(Grunddaten!$G27)+E$10*LOG(Grunddaten!$F27)+E$11*LOG(Grunddaten!$H27)","v":{"$error":"#NUM!"}},{"$f":"F$8+F$9*LOG(Grunddaten!$G27)+F$10*LOG(Grunddaten!$F27)+F$11*LOG(Grunddaten!$H27)","v":{"$error":"#NUM!"}},{"$f":"G$8+G$9*LOG(Grunddaten!$G27)+G$10*LOG(Grunddaten!$F27)+G$11*LOG(Grunddaten!$H27)","v":{"$error":"#NUM!"}},{"$f":"H$8+H$9*LOG(Grunddaten!$G27)+H$10*LOG(Grunddaten!$F27)+H$11*LOG(Grunddaten!$H27)","v":{"$error":"#NUM!"}},{"$f":"I$8+I$9*LOG(Grunddaten!$G27)+I$10*LOG(Grunddaten!$F27)+I$11*LOG(Grunddaten!$H27)","v":{"$error":"#NUM!"}},{"$f":"J$8+J$9*LOG(Grunddaten!$G27)+J$10*LOG(Grunddaten!$F27)+J$11*LOG(Grunddaten!$H27)","v":{"$error":"#NUM!"}},{"$f":"K$8+K$9*LOG(Grunddaten!$G27)+K$10*LOG(Grunddaten!$F27)+K$11*LOG(Grunddaten!$H27)","v":{"$error":"#NUM!"}},{"$f":"L$8+L$9*LOG(Grunddaten!$G27)+L$10*LOG(Grunddaten!$F27)+L$11*LOG(Grunddaten!$H27)","v":{"$error":"#NUM!"}},{"$f":"M$8+M$9*LOG(Grunddaten!$G27)+M$10*LOG(Grunddaten!$F27)+M$11*LOG(Grunddaten!$H27)","v":{"$error":"#NUM!"}},{"$f":"N$8+N$9*LOG(Grunddaten!$G27)+N$10*LOG(Grunddaten!$F27)+N$11*LOG(Grunddaten!$H27)","v":{"$error":"#NUM!"}},{"$f":"O$8+O$9*LOG(Grunddaten!$G27)+O$10*LOG(Grunddaten!$F27)+O$11*LOG(Grunddaten!$H27)","v":{"$error":"#NUM!"}},{"$f":"P$8+P$9*LOG(Grunddaten!$G27)+P$10*LOG(Grunddaten!$F27)+P$11*LOG(Grunddaten!$H27)","v":{"$error":"#NUM!"}},{"$f":"Q$8+Q$9*LOG(Grunddaten!$G27)+Q$10*LOG(Grunddaten!$F27)+Q$11*LOG(Grunddaten!$H27)","v":{"$error":"#NUM!"}},{"$f":"R$8+R$9*LOG(Grunddaten!$G27)+R$10*LOG(Grunddaten!$F27)+R$11*LOG(Grunddaten!$H27)","v":{"$error":"#NUM!"}},{"$f":"S$8+S$9*LOG(Grunddaten!$G27)+S$10*LOG(Grunddaten!$F27)+S$11*LOG(Grunddaten!$H27)","v":{"$error":"#NUM!"}},{"$f":"T$8+T$9*LOG(Grunddaten!$G27)+T$10*LOG(Grunddaten!$F27)+T$11*LOG(Grunddaten!$H27)","v":{"$error":"#NUM!"}},{"$f":"U$8+U$9*LOG(Grunddaten!$G27)+U$10*LOG(Grunddaten!$F27)+U$11*LOG(Grunddaten!$H27)","v":{"$error":"#NUM!"}},{"$f":"V$8+V$9*LOG(Grunddaten!$G27)+V$10*LOG(Grunddaten!$F27)+V$11*LOG(Grunddaten!$H27)","v":{"$error":"#NUM!"}},{"$error":"#NUM!"}]
[{"$f":"Grunddaten!C28","v":"MSA500"},{"$f":"B$8+B$9*LOG(Grunddaten!$G28)+B$10*LOG(Grunddaten!$F28)+B$11*LOG(Grunddaten!$H28)","v":{"$error":"#NUM!"}},{"$f":"C$8+C$9*LOG(Grunddaten!$G28)+C$10*LOG(Grunddaten!$F28)+C$11*LOG(Grunddaten!$H28)","v":{"$error":"#NUM!"}},{"$f":"D$8+D$9*LOG(Grunddaten!$G28)+D$10*LOG(Grunddaten!$F28)+D$11*LOG(Grunddaten!$H28)","v":{"$error":"#NUM!"}},{"$f":"E$8+E$9*LOG(Grunddaten!$G28)+E$10*LOG(Grunddaten!$F28)+E$11*LOG(Grunddaten!$H28)","v":{"$error":"#NUM!"}},{"$f":"F$8+F$9*LOG(Grunddaten!$G28)+F$10*LOG(Grunddaten!$F28)+F$11*LOG(Grunddaten!$H28)","v":{"$error":"#NUM!"}},{"$f":"G$8+G$9*LOG(Grunddaten!$G28)+G$10*LOG(Grunddaten!$F28)+G$11*LOG(Grunddaten!$H28)","v":{"$error":"#NUM!"}},{"$f":"H$8+H$9*LOG(Grunddaten!$G28)+H$10*LOG(Grunddaten!$F28)+H$11*LOG(Grunddaten!$H28)","v":{"$error":"#NUM!"}},{"$f":"I$8+I$9*LOG(Grunddaten!$G28)+I$10*LOG(Grunddaten!$F28)+I$11*LOG(Grunddaten!$H28)","v":{"$error":"#NUM!"}},{"$f":"J$8+J$9*LOG(Grunddaten!$G28)+J$10*LOG(Grunddaten!$F28)+J$11*LOG(Grunddaten!$H28)","v":{"$error":"#NUM!"}},{"$f":"K$8+K$9*LOG(Grunddaten!$G28)+K$10*LOG(Grunddaten!$F28)+K$11*LOG(Grunddaten!$H28)","v":{"$error":"#NUM!"}},{"$f":"L$8+L$9*LOG(Grunddaten!$G28)+L$10*LOG(Grunddaten!$F28)+L$11*LOG(Grunddaten!$H28)","v":{"$error":"#NUM!"}},{"$f":"M$8+M$9*LOG(Grunddaten!$G28)+M$10*LOG(Grunddaten!$F28)+M$11*LOG(Grunddaten!$H28)","v":{"$error":"#NUM!"}},{"$f":"N$8+N$9*LOG(Grunddaten!$G28)+N$10*LOG(Grunddaten!$F28)+N$11*LOG(Grunddaten!$H28)","v":{"$error":"#NUM!"}},{"$f":"O$8+O$9*LOG(Grunddaten!$G28)+O$10*LOG(Grunddaten!$F28)+O$11*LOG(Grunddaten!$H28)","v":{"$error":"#NUM!"}},{"$f":"P$8+P$9*LOG(Grunddaten!$G28)+P$10*LOG(Grunddaten!$F28)+P$11*LOG(Grunddaten!$H28)","v":{"$error":"#NUM!"}},{"$f":"Q$8+Q$9*LOG(Grunddaten!$G28)+Q$10*LOG(Grunddaten!$F28)+Q$11*LOG(Grunddaten!$H28)","v":{"$error":"#NUM!"}},{"$f":"R$8+R$9*LOG(Grunddaten!$G28)+R$10*LOG(Grunddaten!$F28)+R$11*LOG(Grunddaten!$H28)","v":{"$error":"#NUM!"}},{"$f":"S$8+S$9*LOG(Grunddaten!$G28)+S$10*LOG(Grunddaten!$F28)+S$11*LOG(Grunddaten!$H28)","v":{"$error":"#NUM!"}},{"$f":"T$8+T$9*LOG(Grunddaten!$G28)+T$10*LOG(Grunddaten!$F28)+T$11*LOG(Grunddaten!$H28)","v":{"$error":"#NUM!"}},{"$f":"U$8+U$9*LOG(Grunddaten!$G28)+U$10*LOG(Grunddaten!$F28)+U$11*LOG(Grunddaten!$H28)","v":{"$error":"#NUM!"}},{"$f":"V$8+V$9*LOG(Grunddaten!$G28)+V$10*LOG(Grunddaten!$F28)+V$11*LOG(Grunddaten!$H28)","v":{"$error":"#NUM!"}},{"$error":"#NUM!"}]
[{"$f":"Grunddaten!C29","v":"MSA600"},{"$f":"B$8+B$9*LOG(Grunddaten!$G29)+B$10*LOG(Grunddaten!$F29)+B$11*LOG(Grunddaten!$H29)","v":{"$error":"#NUM!"}},{"$f":"C$8+C$9*LOG(Grunddaten!$G29)+C$10*LOG(Grunddaten!$F29)+C$11*LOG(Grunddaten!$H29)","v":{"$error":"#NUM!"}},{"$f":"D$8+D$9*LOG(Grunddaten!$G29)+D$10*LOG(Grunddaten!$F29)+D$11*LOG(Grunddaten!$H29)","v":{"$error":"#NUM!"}},{"$f":"E$8+E$9*LOG(Grunddaten!$G29)+E$10*LOG(Grunddaten!$F29)+E$11*LOG(Grunddaten!$H29)","v":{"$error":"#NUM!"}},{"$f":"F$8+F$9*LOG(Grunddaten!$G29)+F$10*LOG(Grunddaten!$F29)+F$11*LOG(Grunddaten!$H29)","v":{"$error":"#NUM!"}},{"$f":"G$8+G$9*LOG(Grunddaten!$G29)+G$10*LOG(Grunddaten!$F29)+G$11*LOG(Grunddaten!$H29)","v":{"$error":"#NUM!"}},{"$f":"H$8+H$9*LOG(Grunddaten!$G29)+H$10*LOG(Grunddaten!$F29)+H$11*LOG(Grunddaten!$H29)","v":{"$error":"#NUM!"}},{"$f":"I$8+I$9*LOG(Grunddaten!$G29)+I$10*LOG(Grunddaten!$F29)+I$11*LOG(Grunddaten!$H29)","v":{"$error":"#NUM!"}},{"$f":"J$8+J$9*LOG(Grunddaten!$G29)+J$10*LOG(Grunddaten!$F29)+J$11*LOG(Grunddaten!$H29)","v":{"$error":"#NUM!"}},{"$f":"K$8+K$9*LOG(Grunddaten!$G29)+K$10*LOG(Grunddaten!$F29)+K$11*LOG(Grunddaten!$H29)","v":{"$error":"#NUM!"}},{"$f":"L$8+L$9*LOG(Grunddaten!$G29)+L$10*LOG(Grunddaten!$F29)+L$11*LOG(Grunddaten!$H29)","v":{"$error":"#NUM!"}},{"$f":"M$8+M$9*LOG(Grunddaten!$G29)+M$10*LOG(Grunddaten!$F29)+M$11*LOG(Grunddaten!$H29)","v":{"$error":"#NUM!"}},{"$f":"N$8+N$9*LOG(Grunddaten!$G29)+N$10*LOG(Grunddaten!$F29)+N$11*LOG(Grunddaten!$H29)","v":{"$error":"#NUM!"}},{"$f":"O$8+O$9*LOG(Grunddaten!$G29)+O$10*LOG(Grunddaten!$F29)+O$11*LOG(Grunddaten!$H29)","v":{"$error":"#NUM!"}},{"$f":"P$8+P$9*LOG(Grunddaten!$G29)+P$10*LOG(Grunddaten!$F29)+P$11*LOG(Grunddaten!$H29)","v":{"$error":"#NUM!"}},{"$f":"Q$8+Q$9*LOG(Grunddaten!$G29)+Q$10*LOG(Grunddaten!$F29)+Q$11*LOG(Grunddaten!$H29)","v":{"$error":"#NUM!"}},{"$f":"R$8+R$9*LOG(Grunddaten!$G29)+R$10*LOG(Grunddaten!$F29)+R$11*LOG(Grunddaten!$H29)","v":{"$error":"#NUM!"}},{"$f":"S$8+S$9*LOG(Grunddaten!$G29)+S$10*LOG(Grunddaten!$F29)+S$11*LOG(Grunddaten!$H29)","v":{"$error":"#NUM!"}},{"$f":"T$8+T$9*LOG(Grunddaten!$G29)+T$10*LOG(Grunddaten!$F29)+T$11*LOG(Grunddaten!$H29)","v":{"$error":"#NUM!"}},{"$f":"U$8+U$9*LOG(Grunddaten!$G29)+U$10*LOG(Grunddaten!$F29)+U$11*LOG(Grunddaten!$H29)","v":{"$error":"#NUM!"}},{"$f":"V$8+V$9*LOG(Grunddaten!$G29)+V$10*LOG(Grunddaten!$F29)+V$11*LOG(Grunddaten!$H29)","v":{"$error":"#NUM!"}},{"$error":"#NUM!"}]
[]
[]
["Werteübergabe für klassische CAP-Berechnung:",null,null,"Durchlass:",{"$f":"Dimensioning!$D$12","v":"DAL 358"},"K021",{"$f":"SUM('DAL359-CAP'!$C$44,'DAL358-CAP'!$C$44,'DRS-CAP'!$C$44,'DIA-CAP'!$C$44,'MSA-CAP'!$C$44)","v":-124.54},null,"K021Abluft",{"$f":"IF(SUM('DAL359-CAP'!$C$68,'DAL358-CAP'!$C$68,'DRS-CAP'!$C$68,'DIA-CAP'!$C$68,'MSA-CAP'!$C$68)=0,\"\",SUM('DAL359-CAP'!$C$68,'DAL358-CAP'!$C$68,'DRS-CAP'!$C$68,'DIA-CAP'!$C$68,'MSA-CAP'!$C$68))","v":-90.013746180002244}]
[null,null,null,"Lochbild:",{"$f":"Dimensioning!$D$25","v":500},"K022",{"$f":"SUM('DAL359-CAP'!$C$45,'DAL358-CAP'!$C$45,'DRS-CAP'!$C$45,'DIA-CAP'!$C$45,'MSA-CAP'!$C$45)","v":62.47},null,"K022Abluft",{"$f":"IF(SUM('DAL359-CAP'!$C$69,'DAL358-CAP'!$C$69,'DRS-CAP'!$C$69,'DIA-CAP'!$C$69,'MSA-CAP'!$C$69)=0,\"\",SUM('DAL359-CAP'!$C$69,'DAL358-CAP'!$C$69,'DRS-CAP'!$C$69,'DIA-CAP'!$C$69,'MSA-CAP'!$C$69))","v":49.034318413156441}]
[]
[null,"Oktav-Relativspektrum fOkt [Hz] ZULUFT",null,null,null,null,null,null,"SLWA "]
[null,125,250,500,1000,2000,4000,8000,"Summe"]
[{"$f":"A24","v":"DAL 359300"},-9.7481650013372345,-2.3587979588175259,-8.6284171069790396,-9.7175223323966158,-15.488593552715576,-20.713306574136702,-22.676323641380847,{"$f":"10*LOG(10^(0.1*B57)+10^(0.1*C57)+10^(0.1*D57)+10^(0.1*E57)+10^(0.1*F57)+10^(0.1*G57)+10^(0.1*H57))","v":-0.1193317217202815},null,"Relativspektrum vom DAL 359DN 300 übernommen vom DN 400!"]
["DAL 359400",-9.7481650013372345,-2.3587979588175259,-8.6284171069790396,-9.7175223323966158,-15.488593552715576,-20.713306574136702,-22.676323641380847,{"$f":"10*LOG(10^(0.1*B58)+10^(0.1*C58)+10^(0.1*D58)+10^(0.1*E58)+10^(0.1*F58)+10^(0.1*G58)+10^(0.1*H58))","v":-0.1193317217202815},null,"Datenherkunft: \\\\EMCO-WI\\Daten\\daten_EK\\EMCOAIR\\DAL 359\\Berechnung_Oktavspektrum_DAL359_150203"]
["DAL 359500",-7.5505901398238313,-2.9953083681659667,-7.4184113455662226,-10.164842116704346,-17.355090116045091,-24.733287826402485,-28.108746230611157,-9.5423132291552026E-2]
["DAL 359600",-5.7753341730164944,-3.6752977710720978,-6.9781506608245367,-11.092871630745268,-20.069696131964729,-26.685299215509477,-28.430748259604446,-6.4563139503207426E-2]
["DAL 359800",-3.305960812245806,-6.6999251162462627,-6.2229955985621448,-13.345901833733191,-23.797105810964002,-29.884675938480335,-30.393665847139442,-0.12376871727074432]
["DAL 358300",-18.150745478711915,-8.3494741751730537,-6.8400120164211291,-4.9910253438539129,-9.4439800475119355,-12.03691857171575,-18.148920600862759,{"$f":"10*LOG(10^(0.1*B62)+10^(0.1*C62)+10^(0.1*D62)+10^(0.1*E62)+10^(0.1*F62)+10^(0.1*G62)+10^(0.1*H62))","v":-0.57013283674900006},null,"Relativspektrum vom DAL 358DN 300 übernommen vom DN 400!"]
["DAL 358400",-18.150745478711915,-8.3494741751730537,-6.8400120164211291,-4.9910253438539129,-9.4439800475119355,-12.03691857171575,-18.148920600862759,{"$f":"10*LOG(10^(0.1*B63)+10^(0.1*C63)+10^(0.1*D63)+10^(0.1*E63)+10^(0.1*F63)+10^(0.1*G63)+10^(0.1*H63))","v":-0.57013283674900006}]
["DAL 358500",-14.77992515922576,-7.3385135967784958,-5.3339048661276607,-5.2439116794572431,-10.708244158018617,-15.490565190587953,-22.171153887406692,{"$f":"10*LOG(10^(0.1*B64)+10^(0.1*C64)+10^(0.1*D64)+10^(0.1*E64)+10^(0.1*F64)+10^(0.1*G64)+10^(0.1*H64))","v":-0.32041565958029339}]
[{"$f":"A32","v":"DAL 358600"},-12.603601966536422,-6.4939407232442043,-5.2528307463618047,-6.1078966227421168,-11.58787682844906,-14.266274872057245,-21.850307567180526,{"$f":"10*LOG(10^(0.1*B65)+10^(0.1*C65)+10^(0.1*D65)+10^(0.1*E65)+10^(0.1*F65)+10^(0.1*G65)+10^(0.1*H65))","v":-0.28811202986208012}]
["DAL 358800",-12.603601966536422,-6.4939407232442043,-5.2528307463618047,-6.1078966227421168,-11.58787682844906,-14.266274872057245,-21.850307567180526,-0.28811202986208012,null,"Relativspektrum vom DAL 358DN 800 übernommen vom DN 600!"]
["DRS100",-10.488729651925572,-6.2254326601136647,-5.5489447757520907,-8.2003276653433552,-10.616127648943188,-14.449296165477813,-17.537915995993696,-0.46644558945240167]
["DRS125",-10.549518941200013,-5.6121204314631363,-5.6231139897848319,-8.8148353841675693,-11.114566076839031,-15.068470138269737,-17.474005865722596,-0.48424780459377204]
["DRS180",-7.8936146940759162,-5.204997645487218,-6.2025370657272978,-10.063980474231226,-13.635952827853512,-16.896476806237491,-17.614304728906198,-0.53845162649386469]
["DRS250",-11.040862123816998,-7.9722442061574537,-5.3046351018564852,-5.3447156076924527,-10.345655552401759,-16.174411468783212,-20.653678488333298,-0.22193814982778323]
["DRS315",-6.6386516355853811,-6.6194035188932876,-6.6716339595975569,-6.6264923245051177,-11.08365290338163,-19.917954594816525,-24.050926832333211,-0.18034556233566504]
["DRS355",-5.8094503652809575,-6.0391182012988196,-6.9990448310607949,-7.8021983109555162,-13.58122566443355,-20.339507976008445,-21.393267337109837,-0.28176761411123541]
["100",{"$f":"10*LOG(10^(0.1*#REF!)+10^(0.1*#REF!)+10^(0.1*#REF!))","v":{"$error":"#REF!"}},{"$f":"10*LOG(10^(0.1*#REF!)+10^(0.1*#REF!)+10^(0.1*#REF!))","v":{"$error":"#REF!"}},{"$f":"10*LOG(10^(0.1*#REF!)+10^(0.1*#REF!)+10^(0.1*#REF!))","v":{"$error":"#REF!"}},{"$f":"10*LOG(10^(0.1*#REF!)+10^(0.1*#REF!)+10^(0.1*#REF!))","v":{"$error":"#REF!"}},{"$f":"10*LOG(10^(0.1*#REF!)+10^(0.1*#REF!)+10^(0.1*#REF!))","v":{"$error":"#REF!"}},{"$f":"10*LOG(10^(0.1*#REF!)+10^(0.1*#REF!)+10^(0.1*#REF!))","v":{"$error":"#REF!"}},{"$f":"10*LOG(10^(0.1*#REF!)+10^(0.1*#REF!)+10^(0.1*#REF!))","v":{"$error":"#REF!"}},{"$f":"10*LOG(10^(0.1*B73)+10^(0.1*C73)+10^(0.1*D73)+10^(0.1*E73)+10^(0.1*F73)+10^(0.1*G73)+10^(0.1*H73))","v":{"$error":"#REF!"}}]
["125",{"$f":"10*LOG(10^(0.1*#REF!)+10^(0.1*#REF!)+10^(0.1*#REF!))","v":{"$error":"#REF!"}},{"$f":"10*LOG(10^(0.1*#REF!)+10^(0.1*#REF!)+10^(0.1*#REF!))","v":{"$error":"#REF!"}},{"$f":"10*LOG(10^(0.1*#REF!)+10^(0.1*#REF!)+10^(0.1*#REF!))","v":{"$error":"#REF!"}},{"$f":"10*LOG(10^(0.1*#REF!)+10^(0.1*#REF!)+10^(0.1*#REF!))","v":{"$error":"#REF!"}},{"$f":"10*LOG(10^(0.1*#REF!)+10^(0.1*#REF!)+10^(0.1*#REF!))","v":{"$error":"#REF!"}},{"$f":"10*LOG(10^(0.1*#REF!)+10^(0.1*#REF!)+10^(0.1*#REF!))","v":{"$error":"#REF!"}},{"$f":"10*LOG(10^(0.1*#REF!)+10^(0.1*#REF!)+10^(0.1*#REF!))","v":{"$error":"#REF!"}},{"$error":"#REF!"}]
["180",{"$f":"10*LOG(10^(0.1*#REF!)+10^(0.1*#REF!)+10^(0.1*#REF!))","v":{"$error":"#REF!"}},{"$f":"10*LOG(10^(0.1*#REF!)+10^(0.1*#REF!)+10^(0.1*#REF!))","v":{"$error":"#REF!"}},{"$f":"10*LOG(10^(0.1*#REF!)+10^(0.1*#REF!)+10^(0.1*#REF!))","v":{"$error":"#REF!"}},{"$f":"10*LOG(10^(0.1*#REF!)+10^(0.1*#REF!)+10^(0.1*#REF!))","v":{"$error":"#REF!"}},{"$f":"10*LOG(10^(0.1*#REF!)+10^(0.1*#REF!)+10^(0.1*#REF!))","v":{"$error":"#REF!"}},{"$f":"10*LOG(10^(0.1*#REF!)+10^(0.1*#REF!)+10^(0.1*#REF!))","v":{"$error":"#REF!"}},{"$f":"10*LOG(10^(0.1*#REF!)+10^(0.1*#REF!)+10^(0.1*#REF!))","v":{"$error":"#REF!"}},{"$f":"10*LOG(10^(0.1*B75)+10^(0.1*C75)+10^(0.1*D75)+10^(0.1*E75)+10^(0.1*F75)+10^(0.1*G75)+10^(0.1*H75))","v":{"$error":"#REF!"}}]
["250",{"$f":"10*LOG(10^(0.1*#REF!)+10^(0.1*#REF!)+10^(0.1*#REF!))","v":{"$error":"#REF!"}},{"$f":"10*LOG(10^(0.1*#REF!)+10^(0.1*#REF!)+10^(0.1*#REF!))","v":{"$error":"#REF!"}},{"$f":"10*LOG(10^(0.1*#REF!)+10^(0.1*#REF!)+10^(0.1*#REF!))","v":{"$error":"#REF!"}},{"$f":"10*LOG(10^(0.1*#REF!)+10^(0.1*#REF!)+10^(0.1*#REF!))","v":{"$error":"#REF!"}},{"$f":"10*LOG(10^(0.1*#REF!)+10^(0.1*#REF!)+10^(0.1*#REF!))","v":{"$error":"#REF!"}},{"$f":"10*LOG(10^(0.1*#REF!)+10^(0.1*#REF!)+10^(0.1*#REF!))","v":{"$error":"#REF!"}},{"$f":"10*LOG(10^(0.1*#REF!)+10^(0.1*#REF!)+10^(0.1*#REF!))","v":{"$error":"#REF!"}},{"$f":"10*LOG(10^(0.1*B76)+10^(0.1*C76)+10^(0.1*D76)+10^(0.1*E76)+10^(0.1*F76)+10^(0.1*G76)+10^(0.1*H76))","v":{"$error":"#REF!"}}]
["315",{"$f":"10*LOG(10^(0.1*#REF!)+10^(0.1*#REF!)+10^(0.1*#REF!))","v":{"$error":"#REF!"}},{"$f":"10*LOG(10^(0.1*#REF!)+10^(0.1*#REF!)+10^(0.1*#REF!))","v":{"$error":"#REF!"}},{"$f":"10*LOG(10^(0.1*#REF!)+10^(0.1*#REF!)+10^(0.1*#REF!))","v":{"$error":"#REF!"}},{"$f":"10*LOG(10^(0.1*#REF!)+10^(0.1*#REF!)+10^(0.1*#REF!))","v":{"$error":"#REF!"}},{"$f":"10*LOG(10^(0.1*#REF!)+10^(0.1*#REF!)+10^(0.1*#REF!))","v":{"$error":"#REF!"}},{"$f":"10*LOG(10^(0.1*#REF!)+10^(0.1*#REF!)+10^(0.1*#REF!))","v":{"$error":"#REF!"}},{"$f":"10*LOG(10^(0.1*#REF!)+10^(0.1*#REF!)+10^(0.1*#REF!))","v":{"$error":"#REF!"}},{"$error":"#REF!"}]
["355",{"$f":"10*LOG(10^(0.1*#REF!)+10^(0.1*#REF!)+10^(0.1*#REF!))","v":{"$error":"#REF!"}},{"$f":"10*LOG(10^(0.1*#REF!)+10^(0.1*#REF!)+10^(0.1*#REF!))","v":{"$error":"#REF!"}},{"$f":"10*LOG(10^(0.1*#REF!)+10^(0.1*#REF!)+10^(0.1*#REF!))","v":{"$error":"#REF!"}},{"$f":"10*LOG(10^(0.1*#REF!)+10^(0.1*#REF!)+10^(0.1*#REF!))","v":{"$error":"#REF!"}},{"$f":"10*LOG(10^(0.1*#REF!)+10^(0.1*#REF!)+10^(0.1*#REF!))","v":{"$error":"#REF!"}},{"$f":"10*LOG(10^(0.1*#REF!)+10^(0.1*#REF!)+10^(0.1*#REF!))","v":{"$error":"#REF!"}},{"$f":"10*LOG(10^(0.1*#REF!)+10^(0.1*#REF!)+10^(0.1*#REF!))","v":{"$error":"#REF!"}},{"$error":"#REF!"}]
["MSA300",-8.7960582009526895,-5.5280530233665344,-7.8839217987117411,-11.074434296005533,-15.375794568657676,-14.354695930733403,-11.267406430873127,-1.0060958422459036]
["MSA400",-15.89724876380525,-7.256522993908554,-5.9944329038965236,-5.9178348609354527,-12.132307906877694,-16.27902398126713,-21.911045665669079,-0.90177752515362353]
["MSA500",-12.275573305273594,-5.8514345745326386,-5.6634427552631292,-7.6766176504992814,-15.286130167072647,-19.102917801417171,-22.648565262955522,{"$f":"10*LOG(10^(0.1*B81)+10^(0.1*C81)+10^(0.1*D81)+10^(0.1*E81)+10^(0.1*F81)+10^(0.1*G81)+10^(0.1*H81))","v":-0.9223853573449502}]
["MSA600",-9.4955718375999556,-4.9546636487938782,-5.9656499834258261,-9.0435138599850404,-17.354544417830443,-20.927736147184834,-22.771186838019329,-0.74981356351910589]
[null,2,3,4,5,6,7,8,9]
["Gewählter Durchlass, Zuluft:"]
[{"$f":"CONCATENATE(E52,E53)","v":"DAL 358500"},{"$f":"VLOOKUP($A$85,$A$57:$H$82,B83,FALSE)","v":-14.77992515922576},{"$f":"VLOOKUP($A$85,$A$57:$H$82,C83,FALSE)","v":-7.3385135967784958},-5.3339048661276607,-5.2439116794572431,-10.708244158018617,-15.490565190587953,-22.171153887406692]
["Gewählter Durchlass, Abluft:"]
[{"$f":"CONCATENATE(E52,E53)","v":"DAL 358500"},{"$f":"VLOOKUP($A$87,$A$96:$H$121,B83,FALSE)","v":-10.421693489358001},{"$f":"VLOOKUP($A$87,$A$96:$H$121,C83,FALSE)","v":-6.5984613837740493},-6.9717899734723492,-8.7359640089274251,-11.757279319600404,-13.398058324404337,-15.180670226493865]
["A-Bewertung:",-16.100000000000001,-8.6,-3.2,0,1.2,1,-1.1000000000000001]
[{"$f":"CONCATENATE(Dimensioning!$D$8,\"ZUL\",Dimensioning!$D$12,Dimensioning!$D$18)","v":"ZULDAL 358500"},{"$f":"$I$89+B85","v":19.608005571335944},{"$f":"$I$89+C85","v":27.049417133783209},29.054025864434045,29.144019051104465,23.679686572543091,18.897365539973755,12.216776843155014,{"$f":"IF($G$52+$G$53*LOG(Einheiten!$D$18)<25,\"<25\",$G$52+$G$53*LOG(Einheiten!$D$18))","v":34.387930730561706}]
[{"$f":"CONCATENATE(Dimensioning!$D$8,\"ABL\",Dimensioning!$D$12,Dimensioning!$D$18)","v":"ABLDAL 358500"},{"$f":"$I$90+B87","v":24.311202882047375},{"$f":"$I$90+C87","v":28.134434987631323},27.761106397933027,25.996932362477949,22.975617051804971,21.334838047001035,{"$f":"$I$90+H87","v":19.552226144911508},{"$f":"IF($J$52+$J$53*LOG(Einheiten!$D$18)<25,\"<25\",$J$52+$J$53*LOG(Einheiten!$D$18))","v":34.732896371405374}]
["Rückgabe ZUL",{"$f":"IF($I$89=\"<25\",\"\",B89-B88)","v":35.708005571335946},{"$f":"IF($I$89=\"<25\",\"\",C89-C88)","v":35.64941713378321},{"$f":"IF($I$89=\"<25\",\"\",D89-D88)","v":32.254025864434048},{"$f":"IF($I$89=\"<25\",\"\",E89-E88)","v":29.144019051104465},22.479686572543091,17.897365539973755,13.316776843155013]
["Rückgabe ABL",{"$f":"IF($I$90=\"<25\",\"\",B90-B88)","v":40.411202882047377},{"$f":"IF($I$90=\"<25\",\"\",C90-C88)","v":36.734434987631325},30.961106397933026,25.996932362477949,21.775617051804971,20.334838047001035,20.652226144911509]
[]
[null,"Oktav-Relativspektrum fOkt [Hz] ABLUFT",null,null,null,null,null,null,"SLWA "]
[null,125,250,500,1000,2000,4000,8000,"Summe"]
[{"$f":"A57","v":"DAL 359300"},-11.692288650875099,-7.5570388237357431,-9.2734663123307151,-6.2480760413347562,-7.0508347807174996,-12.130270913937309,-14.238971613965139,{"$f":"10*LOG(10^(0.1*B96)+10^(0.1*C96)+10^(0.1*D96)+10^(0.1*E96)+10^(0.1*F96)+10^(0.1*G96)+10^(0.1*H96))","v":-0.48272457875338692}]
["DAL 359400",-11.159609322081582,-7.1779320929390664,-7.6015750860123203,-6.0637418436987645,-9.5871382342400118,-14.701819724059153,-16.095212266798431,{"$f":"10*LOG(10^(0.1*B97)+10^(0.1*C97)+10^(0.1*D97)+10^(0.1*E97)+10^(0.1*F97)+10^(0.1*G97)+10^(0.1*H97))","v":-0.66640976566315002}]
["DAL 359500",-10.50509419415938,-8.4111187812728883,-7.1176779773706098,-5.8890075103296091,-9.214357982505005,-15.164071375736919,-17.097800896212419,-0.68101586112741286]
["DAL 359600",-8.0610642424339058,-8.8859760821361302,-7.6235773027710865,-8.2725159366598913,-11.277547356036862,-14.377085181609271,-13.752123774014251,-1.1897426726361584]
["DAL 359800",-8.0610642424339058,-8.8859760821361302,-7.6235773027710865,-8.2725159366598913,-11.277547356036862,-14.377085181609271,-13.752123774014251,-1.1897426726361584,null,"Relativspektrum vom DAL 359DN 800 übernommen vom DN 600!"]
["DAL 358300",-10.876959162871021,-5.8099792964815453,-8.610648973295211,-10.263742501272922,-11.882672719460363,-11.997618641397164,-11.926664858547579,{"$f":"10*LOG(10^(0.1*B101)+10^(0.1*C101)+10^(0.1*D101)+10^(0.1*E101)+10^(0.1*F101)+10^(0.1*G101)+10^(0.1*H101))","v":-1.1459872775860163}]
["DAL 358400",-9.335055085299496,-5.747804685198699,-7.4437524705089455,-8.5216048631186876,-11.695014019062604,-13.081597308222239,-14.873667610156513,{"$f":"10*LOG(10^(0.1*B102)+10^(0.1*C102)+10^(0.1*D102)+10^(0.1*E102)+10^(0.1*F102)+10^(0.1*G102)+10^(0.1*H102))","v":-0.69112524371205786}]
["DAL 358500",-10.421693489358001,-6.5984613837740493,-6.9717899734723492,-8.7359640089274251,-11.757279319600404,-13.398058324404337,-15.180670226493865,{"$f":"10*LOG(10^(0.1*B103)+10^(0.1*C103)+10^(0.1*D103)+10^(0.1*E103)+10^(0.1*F103)+10^(0.1*G103)+10^(0.1*H103))","v":-1.0402713785341688}]
["DAL 358600",-7.5294770335353149,-6.9707139217032958,-7.4620519822521389,-8.7549169893046344,-11.158502868250821,-13.562686648158024,-16.086877470013164,{"$f":"10*LOG(10^(0.1*B104)+10^(0.1*C104)+10^(0.1*D104)+10^(0.1*E104)+10^(0.1*F104)+10^(0.1*G104)+10^(0.1*H104))","v":-0.78143578779508283}]
["DAL 358800",-7.5294770335353149,-6.9707139217032958,-7.4620519822521389,-8.7549169893046344,-11.158502868250821,-13.562686648158024,-16.086877470013164,-0.78143578779508283,null,"Relativspektrum vom DAL 358DN 800 übernommen vom DN 600!"]
["DRS100",-18.694808503399479,-13.440561955785506,-7.9585656477627182,-6.7940057004982837,-7.9746835586575999,-15.326173463485777,-18.534355649988299,-2.0012123621304525]
["DRS125",-15.223867429922688,-11.226819296644081,-9.001729912913806,-5.7411707608636116,-11.618078887054358,-17.518639852851187,-16.623110424863825,-2.1735184108677705]
["DRS180",-14.535143010384036,-10.090690845984728,-6.9979390654858333,-6.7244354996395312,-13.058819722813023,-15.301793439717496,-13.722036383286641,-1.7604813372202577]
["DRS250",-13.644202286707136,-10.395468147627847,-6.4708454740946291,-3.6723943905969447,-13.40516888486427,-19.301727929405963,-18.604637323296849,-0.6531300804483896]
["DRS315",-6.8833283016090778,-10.134224334007847,-7.8713941122882378,-9.3919122854247252,-12.671434972938854,-12.253219238824963,-9.4141196795766326,-0.92470292515800212]
["DRS355",-7.3156636753156334,-9.4797140637336774,-8.2955419037607356,-7.9138179225767118,-12.862234070264941,-14.162669306546963,-11.424298300388244,-1.1344459414003492]
["100",null,null,null,null,null,null,null,8.4509804001425675]
["125",null,null,null,null,null,null,null,8.4509804001425675]
["180",null,null,null,null,null,null,null,8.4509804001425675]
[{"$f":"A76","v":"250"},null,null,null,null,null,null,null,{"$f":"10*LOG(10^(0.1*B115)+10^(0.1*C115)+10^(0.1*D115)+10^(0.1*E115)+10^(0.1*F115)+10^(0.1*G115)+10^(0.1*H115))","v":8.4509804001425675}]
["315",null,null,null,null,null,null,null,8.4509804001425675]
["355",null,null,null,null,null,null,null,8.4509804001425675]
["MSA300",-12.859540974560719,-9.0006499384348615,-7.3609481684798679,-4.9216317733547843,-10.546851551928436,-14.808434588635091,-16.740346221392208,-0.83209776752434061]
["MSA400",-10.274577529392378,-7.8150989253556657,-7.9519461821382098,-7.3804214310206984,-12.981583122141831,-14.493858652531713,-13.344995417118332,{"$f":"10*LOG(10^(0.1*B119)+10^(0.1*C119)+10^(0.1*D119)+10^(0.1*E119)+10^(0.1*F119)+10^(0.1*G119)+10^(0.1*H119))","v":-1.3403438669924457}]
["MSA500",-8.8082167554670683,-7.33100056052462,-6.840568193825689,-9.3758952690583506,-14.037187754270136,-14.00616388449364,-10.861455568705981,-0.96836510064029446]
["MSA600",-7.608994460186068,-10.459342384040479,-8.0689308049248929,-10.167620797382863,-14.410717444218585,-13.460656899407439,-10.100893714019525,-1.5827254770529986]
[]
[]
["T[s] nach VDI 2081",null,null,null,"Nachhallzeit","Richtungsfaktor","Raumvolumen","äqu. Absorptionsfläche"]
["Raumart",null,"s",null,"t","Q","V","A"]
["single office room",null,0.5,null,"s",null,"m³","m²Sabine"]
["open space office",null,0.5,{"$f":"Dimensioning!D45","v":"single office room"},{"$f":"VLOOKUP(D127,Lw!$A$126:$C$149,3,FALSE)","v":0.5},4,{"$f":"Einheiten!$D$19*Einheiten!$D$20*Einheiten!$D$21","v":300},{"$f":"0.163*G127/E127","v":97.8}]
["Workshops",null,1.5]
["Chemical-Laboratory",null,1]
["Concert halls.",null,2]
["Theaters. Cinemas.",null,0.5]
["Conference rooms",null,2]
["Hotel rooms",null,2]
["Break rooms",null,2]
["Washroom , Toilets ",null,1.5]
["Lecture halls",null,1.5]
["Classrooms / seminar rooms",null,1]
["Auditorium",null,1.5]
["Patient rooms",null,1.5]
["Operating theatre (room)",null,1]
["Swimming pools",null,1]
["Museum",null,1]
["Restaurants",null,"x"]
["Showrooms",null,1]
["Gymnasiums",null,0.5]
["Radio and TV Studios",null,1]
["Computer rooms",null,1]
["Kitchen",null,1]
["no type",null,2]

{"sheet":"DR","index":9,"n_rows":39,"n_cols":6,"rows_kept":39,"cut":false,"hidden":true,"merged":[[0,0,0,10]]}
["Berechnung des Zugluftrisikos"]
["Achtung: Automatisierte Konstantenauswahl aus den \"-CAP\" Arbeitsblättern"]
["Annahme:","Turbulenzgrad =",40,"%"]
[]
["Konstanten Temperaturverhältnis",null,"K051",{"$f":"SUM('DAL359-CAP'!$C$53,'DAL358-CAP'!$C$53,'DRS-CAP'!$C$53,'DIA-CAP'!$C$53,'MSA-CAP'!$C$53)","v":0.13200000000000001}]
[null,null,"K052",{"$f":"SUM('DAL359-CAP'!$C$54,'DAL358-CAP'!$C$54,'DRS-CAP'!$C$54,'DIA-CAP'!$C$54,'MSA-CAP'!$C$54)","v":1}]
["Temperaturen","Zuluft",{"$f":"Einheiten!$D$26","v":21}]
[null,"Raum",{"$f":"Einheiten!$D$27","v":20}]
[]
["1. Zugluftrisiko im Fußbodenbereich"]
[null,"Lauflänge",{"$f":"xkr._vx!$L$24","v":5.5}]
[null,"Luftgeschwindigkeit, errechnet",{"$f":"xkr._vx!$N$24","v":6.8790909090909083E-2}]
[null,"Luftgeschwindigkeit, gesetzt",{"$f":"IF(C12<0.05,0.05,C12)","v":6.8790909090909083E-2}]
[null,"lok. Temperaturdifferenz",{"$f":"($C$8-$C$7)*$D$5*(1/C11)^$D$6","v":-2.4E-2}]
[null,"Absolute Temperatur",{"$f":"C8-C14","v":20.024000000000001}]
[null,"Zugluftrisiko",{"$f":"IF((34-C15)*((C13-0.05)^0.62)*(0.37*C13*$C$3+3.14)>100,100,IF((34-C15)*((C13-0.05)^0.62)*(0.37*C13*$C$3+3.14)<0,0,(34-C15)*((C13-0.05)^0.62)*(0.37*C13*$C$3+3.14)))","v":4.9445414514207657}]
[]
["2. Zugluftrisiko nach Stoßpunkt"]
[null,"Lauflänge",{"$f":"xkr._vx!$L$26","v":2.2000000000000002}]
[null,"Luftgeschwindigkeit, errechnet",{"$f":"xkr._vx!$N$26","v":0.10859644087256025}]
[null,"Luftgeschwindigkeit, gesetzt",{"$f":"IF(C20<0.05,0.05,C20)","v":0.10859644087256025}]
[null,"lok. Temperaturdifferenz",{"$f":"($C$8-$C$7)*$D$5*(1/C19)^$D$6","v":-0.06}]
[null,"Absolute Temperatur",{"$f":"C8-C22","v":20.059999999999999}]
[null,"Zugluftrisiko",{"$f":"IF((34-C23)*((C21-0.05)^0.62)*(0.37*C21*$C$3+3.14)>100,100,IF((34-C23)*((C21-0.05)^0.62)*(0.37*C21*$C$3+3.14)<0,0,(34-C23)*((C21-0.05)^0.62)*(0.37*C21*$C$3+3.14)))","v":11.396801129497286}]
[]
["3. Zugluftrisiko nach Ablösen an X_kritisch"]
[null,"Lauflänge",{"$f":"xkr._vx!$L$28","v":5.9738582218913745}]
[null,"Luftgeschwindigkeit, errechnet",{"$f":"xkr._vx!N28","v":6.3334278442284675E-2}]
[null,"Luftgeschwindigkeit, gesetzt",{"$f":"IF(C28<0.05,0.05,C28)","v":6.3334278442284675E-2}]
[null,"lok. Temperaturdifferenz",{"$f":"($C$8-$C$7)*$D$5*(1/C27)^$D$6","v":-2.2096272642742377E-2}]
[null,"Absolute Temperatur",{"$f":"C8-C30","v":20.022096272642742}]
[null,"Zugluftrisiko",{"$f":"IF((34-C31)*((C29-0.05)^0.62)*(0.37*C29*$C$3+3.14)>100,100,IF((34-C31)*((C29-0.05)^0.62)*(0.37*C29*$C$3+3.14)<0,0,(34-C31)*((C29-0.05)^0.62)*(0.37*C29*$C$3+3.14)))","v":3.9201334780214987}]
[]
["4. Temperaturdifferenz bei angegebener Lauflänge (Achtung! Sonderapplikation Klimakontor bzw. HTS Kanada)"]
[null,"Lauflänge",{"$f":"Einheiten!B35","v":4.2768019470436602}]
[null,"Luftgeschwindigkeit, errechnet",{"$f":"xkr._vx!N33","v":0.37834999999999996},null,"K051",{"$f":"SUM('DAL359-CAP'!$C$53,'DAL358-CAP'!$C$53,'DRS-CAP'!$C$53,'DIA-CAP'!$C$53,'MSA-CAP'!$C$53)","v":0.13200000000000001}]
[null,"Luftgeschwindigkeit, gesetzt",{"$f":"IF(C36<0.05,0.05,C36)","v":0.37834999999999996},null,"K052",{"$f":"SUM('DAL359-CAP'!$C$54,'DAL358-CAP'!$C$54,'DRS-CAP'!$C$54,'DIA-CAP'!$C$54,'MSA-CAP'!$C$73)","v":1}]
[null,"lok. Temperaturdifferenz",{"$f":"($C$8-$C$7)*$D$5*(1/C35)^$D$6","v":-3.086418347972485E-2},null,null,{"$f":"1.3/F36","v":9.8484848484848477}]
[null,"Absolute Temperatur",{"$f":"C8-C38","v":20.030864183479725}]

{"sheet":"xkr._vx","index":10,"n_rows":66,"n_cols":21,"rows_kept":66,"cut":false,"hidden":false,"merged":[]}
["Geschwindigkeit im Strahl und kritischer Strahlweg",null,null,null,null,null,"Annahme:","Winkel nach xkrit",45]
["Achtung: Automatisierte Konstantenauswahl aus den \"-CAP\" Arbeitsblättern"]
["Konstanten","K031",{"$f":"SUM('DAL359-CAP'!C46,'DAL358-CAP'!C46,'DRS-CAP'!C46,'DIA-CAP'!C46,'MSA-CAP'!C46)","v":1.0809999999999999E-3},null,"Konstanten:","K041",{"$f":"SUM('DAL359-CAP'!C50,'DAL358-CAP'!C50,'DRS-CAP'!C50,'DIA-CAP'!C50,'MSA-CAP'!C50)","v":1.166E-2},null,"Konstanten","K071",{"$f":"SUM('DAL358-CAP'!C55,'MSA-CAP'!C55)","v":2.5134375E-3}]
[null,"K032",{"$f":"SUM('DAL359-CAP'!C47,'DAL358-CAP'!C47,'DRS-CAP'!C47,'DIA-CAP'!C47,'MSA-CAP'!C47)","v":1.07},null,null,"K042",{"$f":"SUM('DAL359-CAP'!C51,'DAL358-CAP'!C51,'DRS-CAP'!C51,'DIA-CAP'!C51,'MSA-CAP'!C51)","v":0.51439999999999997},null,null,"K072",{"$f":"SUM('DAL358-CAP'!C56,'MSA-CAP'!C56)","v":0.5}]
[null,"K033",{"$f":"SUM('DAL359-CAP'!C48,'DAL358-CAP'!C48,'DRS-CAP'!C48,'DIA-CAP'!C48,'MSA-CAP'!C48)","v":1},null,null,"K043",{"$f":"SUM('DAL359-CAP'!C52,'DAL358-CAP'!C52,'DRS-CAP'!C52,'DIA-CAP'!C52,'MSA-CAP'!C52)","v":1.008},null,null,"K081",{"$f":"SUM('DAL358-CAP'!C57,'MSA-CAP'!C57)","v":6.3656249999999998E-3}]
[null,"K034",{"$f":"SUM('DAL359-CAP'!C49,'DAL358-CAP'!C49,'DRS-CAP'!C49,'DIA-CAP'!C49,'MSA-CAP'!C49)","v":0.70699999999999996},null,null,"Dt0",{"$f":"IF(Einheiten!$D$27-Einheiten!$D$26>0,Einheiten!$D$27-Einheiten!$D$26,ABS(Einheiten!$D$27-Einheiten!$D$26))","v":1},null,null,"K082",{"$f":"SUM('DAL358-CAP'!C58,'MSA-CAP'!C58)","v":0.64300000000000002}]
[null,null,null,null,null,null,null,null,null,"K083",{"$f":"SUM('DAL358-CAP'!C59,'MSA-CAP'!C59)","v":1.2869999999999999}]
[null,"Lauflänge","Geschwindigkeit im Strahl horizontal","Geschwindigkeit im Strahl vertikal",null,"kritischer Strahlweg Anzeige","kritischer Strahlweg","vertikaler Strahlweg",null,"Geschwindigkeit im Strahl an xKr"]
[null,"L","v0","v1",null,"xkr._Anzeige","xkr.","y",null,"v0"]
[null,"m","m/s","m/s",null,"m","m","m",null,"m/s"]
[null,0.5,{"$f":"$C$3*Einheiten!$D$18*(1/xkr._vx!B11)^xkr._vx!$C$5","v":0.75669999999999993},{"$f":"1/B11*$J$11","v":0.17693126999324083},null,{"$f":"IF($J$27<Einheiten!$D$20,$J$27,\">Room length\")","v":4.2768019470436602},{"$f":"IF(J27<Einheiten!$D$20,xkr._vx!J27,Einheiten!$D$20)","v":4.2768019470436602},{"$f":"(Einheiten!$D$19-Einheiten!$D$22)/SIN(45/180*PI())","v":1.697056274847714},null,{"$f":"$C$3*Einheiten!$D$18*(1/xkr._vx!G11)^(xkr._vx!$C$5)","v":8.8465634996620413E-2}]
[null,0.6,{"$f":"$C$3*Einheiten!$D$18*(1/xkr._vx!B12)^xkr._vx!$C$5","v":0.63058333333333327},{"$f":"1/B12*$J$11","v":0.14744272499436736}]
[null,0.7,{"$f":"$C$3*Einheiten!$D$18*(1/xkr._vx!B13)^xkr._vx!$C$5","v":0.54049999999999998},0.12637947856660059]
[null,0.8,{"$f":"$C$3*Einheiten!$D$18*(1/xkr._vx!B14)^xkr._vx!$C$5","v":0.47293749999999996},0.11058204374577552]
[null,0.9,{"$f":"$C$3*Einheiten!$D$18*(1/xkr._vx!B15)^xkr._vx!$C$5","v":0.42038888888888887},{"$f":"1/B15*$J$11","v":9.8295149996244904E-2}]
[null,1,{"$f":"$C$3*Einheiten!$D$18*(1/xkr._vx!B16)^xkr._vx!$C$5","v":0.37834999999999996},8.8465634996620413E-2]
[null,1.1000000000000001,{"$f":"$C$3*Einheiten!$D$18*(1/xkr._vx!B17)^xkr._vx!$C$5","v":0.3439545454545454},8.0423304542382196E-2]
[null,1.2,{"$f":"$C$3*Einheiten!$D$18*(1/xkr._vx!B18)^xkr._vx!$C$5","v":0.31529166666666664},7.3721362497183682E-2]
[null,1.3,{"$f":"$C$3*Einheiten!$D$18*(1/xkr._vx!B19)^xkr._vx!$C$5","v":0.29103846153846147},6.8050488458938768E-2]
[null,1.4,{"$f":"$C$3*Einheiten!$D$18*(1/xkr._vx!B20)^xkr._vx!$C$5","v":0.27024999999999999},{"$f":"1/B20*$J$11","v":6.3189739283300295E-2}]
[null,1.5,{"$f":"$C$3*Einheiten!$D$18*(1/xkr._vx!B21)^xkr._vx!$C$5","v":0.25223333333333331},5.8977089997746937E-2]
[null,1.6,{"$f":"$C$3*Einheiten!$D$18*(1/xkr._vx!B22)^xkr._vx!$C$5","v":0.23646874999999998},5.5291021872887758E-2,null,null,null,null," 1/2 Durchlassabstand","hor. Lauflänge","ver. Lauflänge","ges. Lauflänge","Geschw. Endpunkt","Geschw. OK A-Ber."]
[null,1.7,{"$f":"$C$3*Einheiten!$D$18*(1/xkr._vx!B23)^xkr._vx!$C$5","v":0.22255882352941175},5.2038608821541418E-2,"Betrachtung Strahlweg frei entlang der Decke bis Wandkante",null,null,null,null,{"$f":"Einheiten!D23","v":2},null,null,{"$f":"$C$3*Einheiten!$D$18*(1/xkr._vx!J23)^xkr._vx!$C$5","v":0.18917499999999998}]
[null,1.8,{"$f":"$C$3*Einheiten!$D$18*(1/xkr._vx!B24)^xkr._vx!$C$5","v":0.21019444444444443},4.9147574998122452E-2,"Betrachtung Strahlweg von Wandkante bis Fußboden Aufenthaltsbereich",null,null,null,null,null,{"$f":"Einheiten!$D$19+0.5","v":3.5},{"$f":"K24+J23","v":5.5},null,{"$f":"$C$3*Einheiten!$D$18*(1/xkr._vx!L24)^xkr._vx!$C$5","v":6.8790909090909083E-2}]
[null,1.9,{"$f":"$C$3*Einheiten!$D$18*(1/xkr._vx!B25)^xkr._vx!$C$5","v":0.19913157894736838},4.6560860524537055E-2,"Betrachtung Strahlweg von Durchlassmitte bis Stoßpunkt",null,null,null,{"$f":"Einheiten!$D$24/2","v":1},null,null,null,{"$f":"$C$3*Einheiten!$D$18*(1/xkr._vx!I25)^xkr._vx!$C$5","v":0.37834999999999996}]
[null,2,{"$f":"$C$3*Einheiten!$D$18*(1/xkr._vx!B26)^xkr._vx!$C$5","v":0.18917499999999998},4.4232817498310206E-2,"Betrachtung Freistrahl ab Stoßpunkt bis Oberkante Aufenthaltsbereich",null,null,null,null,null,{"$f":"Einheiten!$D$19-Einheiten!$D$22","v":1.2},{"$f":"K26+I25","v":2.2000000000000002},null,{"$f":"$C$3*Einheiten!$D$18*(1/((xkr._vx!I25+xkr._vx!K26)+xkr._vx!$C$4*xkr._vx!K26))^xkr._vx!$C$5","v":0.10859644087256025}]
[null,2.1,{"$f":"$C$3*Einheiten!$D$18*(1/xkr._vx!B27)^xkr._vx!$C$5","v":0.18016666666666664},4.2126492855533527E-2,"Betrachtung Strahlweg bis xkritisch",null,null,null,null,{"$f":"$G$3*Einheiten!$D$18^$G$5*(1/xkr._vx!$G$6^(xkr._vx!$G$4))","v":4.2768019470436602},null,null,{"$f":"$C$3*Einheiten!$D$18*(1/xkr._vx!J27)^xkr._vx!$C$5","v":8.8465634996620413E-2}]
[null,2.2000000000000002,{"$f":"$C$3*Einheiten!$D$18*(1/xkr._vx!B28)^xkr._vx!$C$5","v":0.1719772727272727},4.0211652271191098E-2,"Betrachtung von xkritisch bis Oberkante Aufenthaltsbereich",null,null,null,null,null,{"$f":"(Einheiten!$D$19-Einheiten!$D$22)/SIN($I$1/180*PI())","v":1.697056274847714},{"$f":"J27+K28","v":5.9738582218913745},null,{"$f":"$C$3*Einheiten!$D$18*(1/xkr._vx!L28)^xkr._vx!$C$5","v":6.3334278442284675E-2}]
[null,2.2999999999999998,{"$f":"$C$3*Einheiten!$D$18*(1/xkr._vx!B29)^xkr._vx!$C$5","v":0.16450000000000001},3.8463319563748009E-2]
[null,2.4,{"$f":"$C$3*Einheiten!$D$18*(1/xkr._vx!B30)^xkr._vx!$C$5","v":0.15764583333333332},3.6860681248591841E-2,"Betrachtung Heizfall (Für MSA), Walzenstellung CD",null,null,null,null,null,null,null,null,null,null,null,null,null,"Öffnungswinkel",null,20]
[null,2.5,{"$f":"$C$3*Einheiten!$D$18*(1/xkr._vx!B31)^xkr._vx!$C$5","v":0.15134},3.5386253998648164E-2,null,null,null,null,null,null,{"$f":"Einheiten!$D$19-Einheiten!$D$22","v":1.2},{"$f":"K31+I30","v":1.2},{"$f":"IF($K$5*(Einheiten!$D$18^xkr._vx!$K$7)/(xkr._vx!G6^xkr._vx!K6)>Dimensioning!$D$37,\"> room height\",$K$5*(Einheiten!$D$18^xkr._vx!$K$7)/(xkr._vx!G6^xkr._vx!K6)>Dimensioning!$D$37)","v":"> room height"},{"$f":"$C$3*Einheiten!$D$18*(1/((xkr._vx!I30+xkr._vx!K31)+xkr._vx!$C$4*xkr._vx!K31))^xkr._vx!$C$5","v":0.15231481481481479},null,null,null,null,"Lauflänge",null,{"$f":"P33/2","v":0.5}]
[null,2.6,{"$f":"$C$3*Einheiten!$D$18*(1/xkr._vx!B32)^xkr._vx!$C$5","v":0.14551923076923073},3.4025244229469384E-2,null,null,null,null,null,null,null,null,null,null,null,null,null,null,"cos a",null,{"$f":"SIN(U30*PI()/180)","v":0.34202014332566871}]
[null,2.7,{"$f":"$C$3*Einheiten!$D$18*(1/xkr._vx!B33)^xkr._vx!$C$5","v":0.1401296296296296},3.2765049998748297E-2,null,null,"Geschwindigkeit bei gegebener Lauflänge (Nur für HTS Kanada)",null,null,null,null,{"$f":"Einheiten!D29","v":1},null,{"$f":"$C$3*Einheiten!$D$18*(1/xkr._vx!L33)^xkr._vx!$C$5","v":0.37834999999999996},"Durchmesser",1,null,null,"h",null,{"$f":"U31*U32","v":0.17101007166283436}]
[null,2.8,{"$f":"$C$3*Einheiten!$D$18*(1/xkr._vx!B34)^xkr._vx!$C$5","v":0.135125},3.1594869641650147E-2,null,null,null,null,null,null,null,null,null,null,"Kreisumfang",{"$f":"PI()*P33","v":3.1415926535897931}]
[null,2.9,{"$f":"$C$3*Einheiten!$D$18*(1/xkr._vx!B35)^xkr._vx!$C$5","v":0.13046551724137931},3.0505391378144973E-2,null,null,null,null,null,null,null,null,null,null,"Höhe",{"$f":"U33","v":0.17101007166283436}]
[null,3,{"$f":"$C$3*Einheiten!$D$18*(1/xkr._vx!B36)^xkr._vx!$C$5","v":0.12611666666666665},2.9488544998873469E-2,null,null,null,null,null,"Maximalgeschw.","ges. Lauflänge bis vmax","Lauflänge vertikal","Wandabstand",null,"Durchströmte Fläche",{"$f":"P34*P35","v":0.53724398482582447}]
[null,3.1,{"$f":"$C$3*Einheiten!$D$18*(1/xkr._vx!B37)^xkr._vx!$C$5","v":0.12204838709677418},2.8537301611813035E-2,null,null,null,null,null,null,null,null,null,null,"V°ges angenähert (Fläche)",{"$f":"N33*P36*3600","v":731.75854197186243}]
[null,3.2,{"$f":"$C$3*Einheiten!$D$18*(1/xkr._vx!B38)^xkr._vx!$C$5","v":0.11823437499999999},2.7645510936443879E-2,null,"Berechnung Wandabstand bei vorgegebener Max. Geschw.",null,null,null,{"$f":"Dimensioning!$D$33","v":0.2},{"$f":"1/(J38/($C$3*Dimensioning!$D$32))^(1/xkr._vx!$C$5)","v":1.8917499999999996},{"$f":"Dimensioning!$D$37-Dimensioning!$D$38","v":1.2},{"$f":"K38-L38","v":0.69174999999999964},null,"Mischtemperatur",{"$f":"DR!C39","v":20.030864183479725}]
[null,3.3,{"$f":"$C$3*Einheiten!$D$18*(1/xkr._vx!B39)^xkr._vx!$C$5","v":0.11465151515151514},2.6807768180794066E-2,null,null,null,null,null,null,null,null,null,null,"Raumtemp.",{"$f":"DR!C8","v":20}]
[null,3.4,{"$f":"$C$3*Einheiten!$D$18*(1/xkr._vx!B40)^xkr._vx!$C$5","v":0.11127941176470588},2.6019304410770709E-2,null,null,null,null,null,null,null,null,null,null,"Zulufttemp.",{"$f":"DR!C7","v":21}]
[null,3.5,{"$f":"$C$3*Einheiten!$D$18*(1/xkr._vx!B41)^xkr._vx!$C$5","v":0.10809999999999999},2.5275895713320118E-2,null,null,null,null,null,null,null,null,null,null,"V° zul",{"$f":"Einheiten!D18","v":350}]
[null,3.6,{"$f":"$C$3*Einheiten!$D$18*(1/xkr._vx!B42)^xkr._vx!$C$5","v":0.10509722222222222},2.4573787499061226E-2,null,null,null,null,null,null,null,null,null,null,"V°2 geschätzt",1400]
[null,3.7,{"$f":"$C$3*Einheiten!$D$18*(1/xkr._vx!B43)^xkr._vx!$C$5","v":0.10225675675675673},2.3909631080167675E-2,null,null,null,null,null,null,null,null,null,null,"res. V°ges",{"$f":"((P42*P39)+(P41*P40))/P38","v":1764.7765805907961}]
[null,3.8,{"$f":"$C$3*Einheiten!$D$18*(1/xkr._vx!B44)^xkr._vx!$C$5","v":9.9565789473684191E-2},2.3280430262268528E-2,null,null,null,null,null,null,null,null,null,null,"i",{"$f":"P43/P41","v":5.042218801687989}]
[null,3.9,{"$f":"$C$3*Einheiten!$D$18*(1/xkr._vx!B45)^xkr._vx!$C$5","v":9.7012820512820522E-2},2.2683496152979595E-2]
[null,4,{"$f":"$C$3*Einheiten!$D$18*(1/xkr._vx!B46)^xkr._vx!$C$5","v":9.4587499999999991E-2},2.2116408749155103E-2]
[null,4.0999999999999996,{"$f":"$C$3*Einheiten!$D$18*(1/xkr._vx!B47)^xkr._vx!$C$5","v":9.2280487804878047E-2},2.1576984145517175E-2]
[null,4.2,{"$f":"$C$3*Einheiten!$D$18*(1/xkr._vx!B48)^xkr._vx!$C$5","v":9.0083333333333321E-2},2.1063246427766764E-2]
[null,4.3,{"$f":"$C$3*Einheiten!$D$18*(1/xkr._vx!B49)^xkr._vx!$C$5","v":8.7988372093023251E-2},2.0573403487586142E-2,null,null,null,null,null,null,null,null,null,null,"DAL 358: i=",5.8]
[null,4.4000000000000004,{"$f":"$C$3*Einheiten!$D$18*(1/xkr._vx!B50)^xkr._vx!$C$5","v":8.598863636363635E-2},2.0105826135595549E-2,null,null,null,null,null,null,null,null,null,null,null,8.3000000000000007]
[null,4.5,{"$f":"$C$3*Einheiten!$D$18*(1/xkr._vx!B51)^xkr._vx!$C$5","v":8.4077777777777765E-2},1.965902999924898E-2]
[null,4.5999999999999996,{"$f":"$C$3*Einheiten!$D$18*(1/xkr._vx!B52)^xkr._vx!$C$5","v":8.2250000000000004E-2},1.9231659781874005E-2]
[null,4.7,{"$f":"$C$3*Einheiten!$D$18*(1/xkr._vx!B53)^xkr._vx!$C$5","v":8.0499999999999988E-2},1.8822475531195832E-2]
[null,4.8,{"$f":"$C$3*Einheiten!$D$18*(1/xkr._vx!B54)^xkr._vx!$C$5","v":7.8822916666666659E-2},1.843034062429592E-2]
[null,4.9000000000000004,{"$f":"$C$3*Einheiten!$D$18*(1/xkr._vx!B55)^xkr._vx!$C$5","v":7.7214285714285694E-2},1.8054211223800083E-2]
[null,5,{"$f":"$C$3*Einheiten!$D$18*(1/xkr._vx!B56)^xkr._vx!$C$5","v":7.5670000000000001E-2},1.7693126999324082E-2]
[null,5.0999999999999996,{"$f":"$C$3*Einheiten!$D$18*(1/xkr._vx!B57)^xkr._vx!$C$5","v":7.4186274509803918E-2},1.7346202940513807E-2]
[null,5.2,{"$f":"$C$3*Einheiten!$D$18*(1/xkr._vx!B58)^xkr._vx!$C$5","v":7.2759615384615367E-2},1.7012622114734692E-2]
[null,5.3,{"$f":"$C$3*Einheiten!$D$18*(1/xkr._vx!B59)^xkr._vx!$C$5","v":7.1386792452830181E-2},1.6691629244645362E-2]
[null,5.4,{"$f":"$C$3*Einheiten!$D$18*(1/xkr._vx!B60)^xkr._vx!$C$5","v":7.0064814814814802E-2},1.6382524999374148E-2]
[null,5.5,{"$f":"$C$3*Einheiten!$D$18*(1/xkr._vx!B61)^xkr._vx!$C$5","v":6.8790909090909083E-2},1.6084660908476441E-2]
[null,5.6,{"$f":"$C$3*Einheiten!$D$18*(1/xkr._vx!B62)^xkr._vx!$C$5","v":6.7562499999999998E-2},1.5797434820825074E-2]
[null,5.7,{"$f":"$C$3*Einheiten!$D$18*(1/xkr._vx!B63)^xkr._vx!$C$5","v":6.6377192982456132E-2},1.5520286841512352E-2]
[null,5.8,{"$f":"$C$3*Einheiten!$D$18*(1/xkr._vx!B64)^xkr._vx!$C$5","v":6.5232758620689654E-2},1.5252695689072487E-2]
[null,5.8999999999999897,{"$f":"$C$3*Einheiten!$D$18*(1/xkr._vx!B65)^xkr._vx!$C$5","v":6.4127118644067907E-2},1.4994175423156028E-2]
[null,6,{"$f":"$C$3*Einheiten!$D$18*(1/xkr._vx!B66)^xkr._vx!$C$5","v":6.3058333333333327E-2},1.4744272499436734E-2]

{"sheet":"Einheiten","index":11,"n_rows":55,"n_cols":7,"rows_kept":55,"cut":false,"hidden":true,"merged":[[16,0,16,1]]}
[]
["Einheitenumrechnung"]
[]
[null,"SI - Einheit","angloamerikanisch"]
["Längenangaben","m","ft","1 ft =",1,"m",0.30480000000000002]
["Rauminhalt","m³","ft³","1 ft³ =",1,"dm³",28.317]
[null,null,null,null,1,"m³",{"$f":"G6/1000","v":2.8317000000000002E-2}]
["Geschwindigkeit","m/s","ft/min","1 ft/min =",1,"cm/s",0.50800000000000001]
[null,null,null,null,1,"m/s",{"$f":"G8/100","v":5.0800000000000003E-3}]
["Volumenstrom","m³/h","ft³/min","1 ft³/min =",1,"l/min",28.317]
[null,null,null,null,1,"m³/h",{"$f":"G10*6/100","v":1.69902}]
["Leistung","W","BTU/h","1 BTU/h =",1,"W",0.29310000000000003]
[null,null,null,null,1,"kW",{"$f":"G12/1000","v":2.9310000000000002E-4}]
[]
[]
[]
["Größen aus Vorgabe/Auslegung (Zahlenwerte angloamerikanisch)",null,null,"Größen zur Weiterberechnung (SI - Einheit)"]
["Gesamtvolumenstrom",{"$f":"Specifications!D8","v":350},"ft³/min",{"$f":"B18*E11/Specifications!$D$9","v":350},"m³/h","Einzelvolumenstrom!"]
["Raumhöhe",{"$f":"Specifications!D14","v":3},"ft",{"$f":"B19*$E$5","v":3},"m"]
["Raumlänge",{"$f":"Specifications!D16","v":10},"ft",{"$f":"B20*$E$5","v":10},"m"]
["Raumbreite",{"$f":"Specifications!D17","v":10},"ft",10,"m"]
["Obergrenze Aufenthaltsbereich",{"$f":"Specifications!D15","v":1.8},"ft",1.8,"m"]
["Abstand Durchlass zur nächstgelegenen Wand",{"$f":"Dimensioning!D41","v":2},"ft",2,"m"]
["kleinster Abstand zwischen 2 Durchlässen",{"$f":"Dimensioning!D42","v":2},"ft",2,"m"]
["Abstand zur Schallquelle",{"$f":"Dimensioning!D73","v":3},"ft",3,"m"]
["Temperatur Zuluft",{"$f":"Specifications!D10","v":21},"°F",{"$f":"B26","v":21},"°C"]
["Temperatur Raum",{"$f":"Specifications!D11","v":20},"°F",{"$f":"B27","v":20},"°C"]
["Temperatur Raum",{"$f":"[1]Specifications!D12","v":36},"°F",{"$f":"(5/9)*B28-17.77","v":2.2300000000000004},"°C"]
["Lauflänge für Induktionsrechner",{"$f":"Dimensioning!$D$121","v":1},"ft",{"$f":"B29*$E$5","v":1},"m"]
[]
[]
["Größen von Weiterberechnung (SI - Einheit)",null,null,"Größen zur Vorgabe/Auslegung (angloamerikanisch)"]
["Kühlleistung",{"$f":"D18*Specifications!$D$9*1.2*1.006*(Einheiten!D27-Einheiten!D26)/3.6","v":-117.36666666666666},"W",{"$f":"B33/E12","v":-117.36666666666666},"BTU/h"]
["Druckverlust",null,"Pa",null,"Pa"]
["kritischer Strahlweg",{"$f":"xkr._vx!$F$11","v":4.2768019470436602},"m",{"$f":"B35/E5","v":4.2768019470436602},"ft"]
["Geschwindigkeit im Fußbodenbereich in Wandnähe",{"$f":"xkr._vx!$N$24","v":6.8790909090909083E-2},"m/s",{"$f":"B36/E9","v":6.8790909090909083E-2},"ft/min"]
["Zugluftrisiko am Fußboden**",{"$f":"DR!$C$16","v":4.9445414514207657},"%",{"$f":"B37","v":4.9445414514207657},"%"]
["Geschwindigkeit im Aufenthaltsbereich*",{"$f":"xkr._vx!$N$26","v":0.10859644087256025},"m/s",{"$f":"B38/E9","v":0.10859644087256025},"ft/min"]
["Zugluftrisiko im Aufenthaltsbereich**",{"$f":"DR!$C$24","v":11.396801129497286},"%",{"$f":"B39","v":11.396801129497286},"%"]
["Geschwindigkeit nach Ablösen an Xkr.",{"$f":"xkr._vx!$N$28","v":6.3334278442284675E-2},"m/s",{"$f":"B40/E9","v":6.3334278442284675E-2},"ft/min"]
["Zugluftrisiko nach Ablösepunkt**",{"$f":"DR!$C$32","v":3.9201334780214987},"%",{"$f":"B41","v":3.9201334780214987},"%"]
["Lauflänge von Induktionsrechner",{"$f":"$D$28","v":2.2300000000000004},"m",{"$f":"B42/E5","v":2.2300000000000004},"ft"]
["Lokale Lufttemperatur",{"$f":"DR!C39","v":20.030864183479725},"°C",{"$f":"B43","v":20.030864183479725},"°F"]
["Lokale Luftgeschwindigkeit induktionsrechner",{"$f":"xkr._vx!N33","v":0.37834999999999996},"m/s",{"$f":"B44/E9","v":0.37834999999999996},"ft/min"]
[]
[]
[]
[]
[]
["Schwarz","S"]
["weiß","W"]
["naturfarbig eloxiert","K"]
["weiß (RAL 9010) bepulvert","L"]
["Anschlusskasten ohne Mengeneinstellung","AK1"]
["Anschlusskasten mit Mengeneinstellung*","AK2"]

{"sheet":"DAL359-CAP","index":12,"n_rows":72,"n_cols":12,"rows_kept":72,"cut":false,"hidden":true,"merged":[[1,6,1,9],[1,13,1,16]]}
["Übergabedaten:",null,"Gewählter Durchlass",null,{"$f":"CONCATENATE(Dimensioning!$D$12,Dimensioning!$D$25,\"d\")","v":"DAL 358500d"}]
[null,null,"Volumenstrom",null,{"$f":"Dimensioning!$D$32","v":350}]
[null,null,"Temperaturdifferenz",null,{"$f":"Dimensioning!$D$35-Dimensioning!$D$34","v":-1}]
[null,null,"DAL 359","DAL 359","DAL 359","DAL 359","DAL 359","DAL 359","DAL 359","DAL 359","DAL 359"]
[null,null,300,400,400,500,500,600,600,800,800]
[null,null,{"$f":"CONCATENATE(C4,C5,\"d\")","v":"DAL 359300d"},{"$f":"CONCATENATE(D4,D5,\"d\")","v":"DAL 359400d"},{"$f":"CONCATENATE(E4,E5,\"f\")","v":"DAL 359400f"},{"$f":"CONCATENATE(F4,F5,\"d\")","v":"DAL 359500d"},{"$f":"CONCATENATE(G4,G5,\"f\")","v":"DAL 359500f"},{"$f":"CONCATENATE(H4,H5,\"d\")","v":"DAL 359600d"},{"$f":"CONCATENATE(I4,I5,\"f\")","v":"DAL 359600f"},{"$f":"CONCATENATE(J4,J5,\"d\")","v":"DAL 359800d"},{"$f":"CONCATENATE(K4,K5,\"f\")","v":"DAL 359800f"},1]
[null,null,"Deckenbündig","Deckenbündig","freihängend","Deckenbündig","freihängend","Deckenbündig","freihängend","Deckenbündig","freihängend",2]
["Konstante","K011",1.3564396446483764E-3,2.6699999999999998E-4,2.63E-4,1.3359999999999999E-4,9.8499999999999995E-5,7.3540000000000004E-5,4.1600000000000002E-5,1.9530000000000001E-5,9.5000000000000005E-6,3]
[null,"K012",2.0215396196408024,1.9970000000000001,2,1.9550000000000001,2,1.9219999999999999,2,1.9079999999999999,2,4]
[null,"K021",-93.241728860158958,-113.4,-113.83,-125.2,-127.15,-142.40600000000001,-119.65,-142.9,-142.41999999999999,5]
[null,"K022",61.295195452125157,58.16,58.34,58.87,59.54,63.15,53.87,56.58,56.47,6]
[null,"K031",3.2000000000000002E-3,2.905E-3,1.74E-3,2.346E-3,1.3699999999999999E-3,1.188E-3,8.9999999999999998E-4,7.6179999999999998E-4,4.1800000000000002E-4,7]
[null,"K032",1,1,1,1,1,1,1,1,1,8]
[null,"K033",1.087,1.087,1,1.087,1,1.087,1.1579999999999999,1.087,1,9]
[null,"K034",0.70699999999999996,0.70699999999999996,null,0.70699999999999996,null,0.70699999999999996,null,0.70699999999999996,null,10]
[null,"K041",2.41E-2,2.087E-2,null,1.7579999999999998E-2,null,8.9079999999999993E-3,null,6.0429999999999998E-3,null,11]
[null,"K042",0.5,0.5,null,0.5,null,0.5,null,0.5,null,12]
[null,"K043",1,1,null,1,null,1,null,1,null,13]
[null,"K051",0.16300000000000001,0.16300000000000001,0.16300000000000001,0.21299999999999999,0.21299999999999999,0.32600000000000001,0.32600000000000001,0.48,0.48,14]
[null,"K052",1.2070000000000001,1.2070000000000001,1.2070000000000001,1.2070000000000001,1.2070000000000001,1.2070000000000001,1.2070000000000001,1.2070000000000001,1.2070000000000001,15]
[null,"K071",null,0,null,0,null,0,null,0,null,16]
[null,"K072",null,0,null,0,null,0,null,0,null,17]
[null,"K081",null,0,null,0,null,0,null,0,null,18]
[null,"K082",null,0,null,0,null,0,null,0,null,19]
[null,"K083",null,0,null,0,null,0,null,0,null,20]
[null,"K091",null,0,null,0,null,0,null,0,null,21]
[null,"K092",null,1500,null,2040,null,3130,null,8960,null,22]
[null,"K093",null,3,null,3,null,3,null,3,null,23]
[null,"K094",null,0,null,0,null,0,null,0,null,24]
[null,"K101",null,-0.69299999999999995,null,-0.69299999999999995,null,-0.69299999999999995,null,-0.69299999999999995,null,25]
[null,"K102",null,33,null,33,null,33,null,33,null,26]
[null,"K103",null,0.06,null,7.4999999999999997E-2,null,9.5000000000000001E-2,null,0.12,null,27]
[null,"K104",null,0.01,null,0.01,null,0.01,null,0.01,null,28]
[null,"K021Abluft",-99.558258540692378,-107.29950575045943,-107.29950575045943,{"$f":"-126.937694154299-3","v":-129.93769415429898},{"$f":"-126.937694154299-3","v":-129.93769415429898},-81.652092447706806,-81.652092447706806,null,null,29]
[null,"K022Abluft",62.064710869111522,57.54374641123853,57.54374641123853,61.553727979774131,61.553727979774131,41.931738754937285,41.931738754937285,null,null,30]
[null,"K011Abluft",1.9881360943777688E-3,3.0857126905320978E-4,3.0857126905320978E-4,6.7898250177364115E-5,6.7898250177364115E-5,4.7214089794199927E-5,4.7214089794199927E-5,null,null,31]
[null,"K012Abluft",1.9519956311320683,1.9644185415338546,1.9644185415338546,2.0742491804922922,2.0742491804922922,2.0087968274452264,2.0087968274452264,null,null,32]
[null,"K061",{"$f":"1.3/C19","v":7.9754601226993866},{"$f":"1.3/D19","v":7.9754601226993866},7.9754601226993866,6.103286384976526,6.103286384976526,3.9877300613496933,3.9877300613496933,2.7083333333333335,2.7083333333333335,33]
[]
[null,null,{"$f":"IFERROR(HLOOKUP($E$1,$C$6:$K$33,L6,FALSE),\"\")","v":""}]
[null,null,{"$f":"IFERROR(HLOOKUP($E$1,$C$6:$K$33,L7,FALSE),\"\")","v":""}]
["Rückgabe","K011",""]
[null,"K012","",null,null,null,null,null,null,{"$f":"1.3/H19","v":3.9877300613496933}]
[null,"K021",""]
[null,"K022",""]
[null,"K031",""]
[null,"K032",""]
[null,"K033",""]
[null,"K034",""]
[null,"K041",""]
[null,"K042",""]
[null,"K043",""]
[null,"K051",""]
[null,"K052",""]
[null,"K071",""]
[null,"K072",""]
[null,"K081",""]
[null,"K082",""]
[null,"K083",""]
[null,"K091",""]
[null,"K092",""]
[null,"K093",""]
[null,"K094",""]
[null,"K101",""]
[null,"K102",""]
[null,"K103",""]
[null,"K104",""]
[null,"K021Abluft",{"$f":"IFERROR(HLOOKUP($E$1,$C$6:$K$35,L34,FALSE),\"\")","v":""}]
[null,"K022Abluft",{"$f":"IFERROR(HLOOKUP($E$1,$C$6:$K$35,L35,FALSE),\"\")","v":""}]
[null,"K011Abluft",{"$f":"IFERROR(HLOOKUP($E$1,$C$6:$K$37,L36,FALSE),\"\")","v":""}]
[null,"K012Abluft",{"$f":"IFERROR(HLOOKUP($E$1,$C$6:$K$37,L37,FALSE),\"\")","v":""}]
[null,"K061",{"$f":"IFERROR(HLOOKUP($E$1,$C$6:$K$38,L38,FALSE),\"\")","v":""}]

{"sheet":"DAL358-CAP","index":13,"n_rows":72,"n_cols":15,"rows_kept":72,"cut":false,"hidden":true,"merged":[[20,14,24,14]]}
["Übergabedaten:",null,"Gewählter Durchlass",null,{"$f":"CONCATENATE(Dimensioning!$D$12,Dimensioning!$D$25,\"d\")","v":"DAL 358500d"}]
[null,null,"Volumenstrom",null,{"$f":"Dimensioning!$D$32","v":350}]
[null,null,"Temperaturdifferenz",null,{"$f":"Dimensioning!$D$35-Dimensioning!$D$34","v":-1}]
[null,null,"DAL 358","DAL 358","DAL 358","DAL 358","DAL 358","DAL 358","DAL 358","DAL 358","DAL 358"]
[null,null,300,400,400,500,500,600,600,800,800]
[null,null,{"$f":"CONCATENATE(C4,C5,\"d\")","v":"DAL 358300d"},{"$f":"CONCATENATE(D4,D5,\"d\")","v":"DAL 358400d"},{"$f":"CONCATENATE(E4,E5,\"f\")","v":"DAL 358400f"},{"$f":"CONCATENATE(F4,F5,\"d\")","v":"DAL 358500d"},{"$f":"CONCATENATE(G4,G5,\"f\")","v":"DAL 358500f"},{"$f":"CONCATENATE(H4,H5,\"d\")","v":"DAL 358600d"},{"$f":"CONCATENATE(I4,I5,\"f\")","v":"DAL 358600f"},{"$f":"CONCATENATE(J4,J5,\"d\")","v":"DAL 358800d"},{"$f":"CONCATENATE(K4,K5,\"f\")","v":"DAL 358800f"},1]
[null,null,"Deckenbündig","Deckenbündig","freihängend","Deckenbündig","freihängend","Deckenbündig","freihängend","Deckenbündig","freihängend",2,null,"A1/F6"]
["Konstante","K011",1.5113277034360106E-3,2.8600000000000001E-3,2.8600000000000001E-3,1.75E-3,1.75E-3,3.0299999999999999E-4,3.0299999999999999E-4,3.01E-4,3.01E-4,3,null,2.5200000000000001E-3]
[null,"K012",1.9941675832634518,1.67,1.67,1.62,1.62,1.77,1.77,1.68,1.68,4,null,1.92]
[null,"K021",-65.683763355297202,-97.77,-97.77,-124.54,-124.54,-136.30000000000001,-136.30000000000001,-141.4,-141.4,5,null,-75.599999999999994]
[null,"K022",48.466188743658236,56.79,56.79,62.47,62.47,63.1,63.1,62.47,62.47,6,null,53.72]
[null,"K031",1.5E-3,1.3110000000000001E-3,1.0300000000000001E-3,1.0809999999999999E-3,8.7500000000000002E-4,9.0910000000000003E-4,7.0699999999999995E-4,7.7669999999999996E-4,6.2200000000000005E-4,7,null,5.0270000000000002E-3]
[null,"K032",1.07,1.07,1,1.07,1,1.07,1,1.07,1,8,null,5.8]
[null,"K033",1,1,1.07,1,1.07,1,1.07,1,1.07,9,null,0.5]
[null,"K034",0.70699999999999996,0.70699999999999996,null,0.70699999999999996,null,0.70699999999999996,null,0.70699999999999996,null,10,null,0.70699999999999996]
[null,"K041",1.78E-2,1.762E-2,null,1.166E-2,null,1.1639999999999999E-2,null,6.0010000000000003E-3,null,11,null,8.8200000000000001E-2]
[null,"K042",0.49680000000000002,0.49680000000000002,null,0.51439999999999997,null,0.52110000000000001,null,0.49180000000000001,null,12,null,0.64300000000000002]
[null,"K043",1.014,1.014,null,1.008,null,0.96260000000000001,null,0.99829999999999997,null,13,null,1.2869999999999999]
[null,"K051",0.10199999999999999,0.10199999999999999,0.10199999999999999,0.13200000000000001,0.13200000000000001,0.18,0.18,0.22,0.22,14,null,4.9660000000000003E-2]
[null,"K052",1,1,1,1,1,1,1,1,1,15,null,0.5]
[null,"K071",8.0429999999999998E-3,{"$f":"N21*(1/2)","v":4.0214999999999999E-3},null,{"$f":"N21*(1/3.2)","v":2.5134375E-3},null,{"$f":"N21*(1/5.2)","v":1.546730769230769E-3},null,{"$f":"N21*(1/7.6)","v":1.0582894736842104E-3},null,16,null,8.0429999999999998E-3,"Heizfallkonstanten SAL 35 aus CAP"]
[null,"K072",0.5,0.5,null,0.5,null,0.5,null,0.5,null,17,null,0.5]
[null,"K081",2.0369999999999999E-2,{"$f":"N23*(1/2)","v":1.0185E-2},null,{"$f":"N23*(1/3.2)","v":6.3656249999999998E-3},null,{"$f":"N23*(1/5.2)","v":3.9173076923076922E-3},null,{"$f":"N23*(1/7.6)","v":2.6802631578947368E-3},null,18,null,2.0369999999999999E-2]
[null,"K082",0.64300000000000002,0.64300000000000002,null,0.64300000000000002,null,0.64300000000000002,null,0.64300000000000002,null,19,null,0.64300000000000002]
[null,"K083",1.2869999999999999,1.2869999999999999,null,1.2869999999999999,null,1.2869999999999999,null,1.2869999999999999,null,20,null,1.2869999999999999]
[null,"K091",null,0,null,0,null,0,null,0,null,21,null,0]
[null,"K092",null,1500,null,2040,null,3130,null,8960,null,22,null,47]
[null,"K093",null,3,null,3,null,3,null,3,null,23,null,2.5]
[null,"K094",null,0,null,0,null,0,null,0,null,24,null,0]
[null,"K101",null,-0.69299999999999995,null,-0.69299999999999995,null,-0.69299999999999995,null,-0.69299999999999995,null,25,null,-0.69299999999999995]
[null,"K102",null,33,null,33,null,33,null,33,null,26,null,24]
[null,"K103",null,0.06,null,7.4999999999999997E-2,null,9.5000000000000001E-2,null,0.12,null,27,null,7.0000000000000001E-3]
[null,"K104",null,0.01,null,0.01,null,0.01,null,0.01,null,28,null,0.01]
[null,"K021Abluft",-40.118064606526026,-83.599570336952624,-83.599570336952624,-90.013746180002244,-90.013746180002244,-88.48537160615038,-88.48537160615038,null,null,29]
[null,"K022Abluft",36.373809935642903,50.024603709663836,50.024603709663836,49.034318413156441,49.034318413156441,45.751689630067332,45.751689630067332,null,null,30]
[null,"K011Abluft",2.2773218367353296E-3,7.7132419021791617E-4,7.7132419021791617E-4,1.1921107976766434E-4,1.1921107976766434E-4,1.8115364712567293E-4,1.8115364712567293E-4,null,null,31]
[null,"K012Abluft",1.9701704849615027,1.8918064416582625,1.8918064416582625,2.046875710470919,2.046875710470919,1.8435647552169692,1.8435647552169692,null,null,32]
[null,"K061",{"$f":"1.3/C19","v":12.745098039215687},{"$f":"1.3/D19","v":12.745098039215687},12.745098039215687,9.8484848484848477,9.8484848484848477,7.2222222222222223,7.2222222222222223,5.9090909090909092,5.9090909090909092,33]
[]
[null,null,{"$f":"IFERROR(HLOOKUP($E$1,$C$6:$K$33,L6,FALSE),\"\")","v":"DAL 358500d"}]
[null,null,{"$f":"IFERROR(HLOOKUP($E$1,$C$6:$K$33,L7,FALSE),\"\")","v":"Deckenbündig"}]
["Rückgabe","K011",1.75E-3]
[null,"K012",1.62,null,null,null,null,null,null,6.6794999999999997E-3,{"$f":"0.0508/J43","v":7.6053596826109739}]
[null,"K021",-124.54]
[null,"K022",62.47]
[null,"K031",1.0809999999999999E-3]
[null,"K032",1.07]
[null,"K033",1]
[null,"K034",0.70699999999999996]
[null,"K041",1.166E-2]
[null,"K042",0.51439999999999997]
[null,"K043",1.008]
[null,"K051",0.13200000000000001]
[null,"K052",1]
[null,"K071",2.5134375E-3]
[null,"K072",0.5]
[null,"K081",6.3656249999999998E-3]
[null,"K082",0.64300000000000002]
[null,"K083",1.2869999999999999]
[null,"K091",0]
[null,"K092",2040]
[null,"K093",3]
[null,"K094",0]
[null,"K101",-0.69299999999999995]
[null,"K102",33]
[null,"K103",7.4999999999999997E-2]
[null,"K104",0.01]
[null,"K021Abluft",{"$f":"IFERROR(HLOOKUP($E$1,$C$6:$K$35,L34,FALSE),\"\")","v":-90.013746180002244}]
[null,"K022Abluft",{"$f":"IFERROR(HLOOKUP($E$1,$C$6:$K$35,L35,FALSE),\"\")","v":49.034318413156441}]
[null,"K011Abluft",{"$f":"IFERROR(HLOOKUP($E$1,$C$6:$K$37,L36,FALSE),\"\")","v":1.1921107976766434E-4}]
[null,"K012Abluft",{"$f":"IFERROR(HLOOKUP($E$1,$C$6:$K$37,L37,FALSE),\"\")","v":2.046875710470919}]
[null,"K061",{"$f":"IFERROR(HLOOKUP($E$1,$C$6:$K$38,L38,FALSE),\"\")","v":9.8484848484848477}]

{"sheet":"DRS-CAP","index":14,"n_rows":72,"n_cols":15,"rows_kept":72,"cut":false,"hidden":true,"merged":[]}
["Übergabedaten:",null,"Gewählter Durchlass",null,{"$f":"CONCATENATE(Dimensioning!$D$12,Dimensioning!$D$25,\"d\")","v":"DAL 358500d"}]
[null,null,"Volumenstrom",null,{"$f":"Dimensioning!$D$32","v":350}]
[null,null,"Temperaturdifferenz",null,{"$f":"Dimensioning!$D$35-Dimensioning!$D$34","v":-1}]
[null,null,"DRS","DRS","DRS","DRS","DRS","DRS","DRS","DRS","DRS","DRS","DRS","DRS",1]
[null,null,100,100,125,125,180,180,250,250,315,315,355,355,2]
[null,null,{"$f":"CONCATENATE(C4,C5,\"d\")","v":"DRS100d"},{"$f":"CONCATENATE(D4,D5,\"f\")","v":"DRS100f"},{"$f":"CONCATENATE(E4,E5,\"d\")","v":"DRS125d"},{"$f":"CONCATENATE(F4,F5,\"f\")","v":"DRS125f"},{"$f":"CONCATENATE(G4,G5,\"d\")","v":"DRS180d"},{"$f":"CONCATENATE(H4,H5,\"f\")","v":"DRS180f"},{"$f":"CONCATENATE(I4,I5,\"d\")","v":"DRS250d"},{"$f":"CONCATENATE(J4,J5,\"f\")","v":"DRS250f"},{"$f":"CONCATENATE(K4,K5,\"d\")","v":"DRS315d"},{"$f":"CONCATENATE(L4,L5,\"f\")","v":"DRS315f"},{"$f":"CONCATENATE(M4,M5,\"d\")","v":"DRS355d"},{"$f":"CONCATENATE(N4,N5,\"f\")","v":"DRS355f"},1]
[null,null,"Deckenbündig","freihängend","Deckenbündig","freihängend","Deckenbündig","freihängend","Deckenbündig","freihängend","Deckenbündig","freihängend","Deckenbündig","freihängend",2]
["Konstante","K011",6.2090000000000001E-3,5.0000000000000001E-3,2.931E-3,2.5000000000000001E-3,7.7030000000000002E-4,7.5000000000000002E-4,1.771E-4,2.22E-4,1.2750000000000001E-4,9.3800000000000003E-5,1.774E-4,5.5600000000000003E-5,3]
[null,"K012",1.944,2,1.97,2,1.9890000000000001,2,2.0350000000000001,2,1.9470000000000001,2,1.837,2,4]
[null,"K021",-63.18,-76.2,-84.65,-84.94,-124.9,-103.77,-125,-133.61000000000001,-131.80000000000001,-124.86,-140,-138.80000000000001,5]
[null,"K022",49.43,54.83,56.22,56.47,67.27,58.13,60.59,64.03,59.05,56.79,59.15,58.6,6]
[null,"K031",3.7690000000000002E-3,2.4220000000000001E-3,3.2669999999999999E-3,2.0370000000000002E-3,2.4069999999999999E-3,1.5330000000000001E-3,1.8779999999999999E-3,1.183E-3,1.5989999999999999E-3,9.8700000000000003E-4,1.405E-3,8.9999999999999998E-4,7]
[null,"K032",1.3,1.61,1.3,1.61,1.3,1.61,1.3,1.61,1.3,1.61,1.3,1.61,8]
[null,"K033",1,1,1,1,1,1,1,1,1,1,1,1,9]
[null,"K034",0.70699999999999996,null,0.70699999999999996,null,0.70699999999999996,null,0.70699999999999996,null,0.70699999999999996,null,0.70699999999999996,null,10]
[null,"K041",0.1356,null,6.13E-2,null,3.0040000000000001E-2,null,2.274E-2,null,7.9830000000000005E-3,null,5.7619999999999998E-3,null,11]
[null,"K042",0.48849999999999999,null,0.47949999999999998,null,0.50639999999999996,null,0.4642,null,0.4829,null,0.50919999999999999,null,12]
[null,"K043",0.98180000000000001,null,1.0349999999999999,null,1.0269999999999999,null,0.92330000000000001,null,1.01,null,1.0229999999999999,null,13]
[null,"K051",0.04,null,5.0999999999999997E-2,null,0.1,null,0.13,null,0.15,null,0.16,null,14]
[null,"K052",1,null,0.95899999999999996,null,1,null,1.016,null,1,null,1.016,null,15]
[null,"K071",0,null,0,null,0,null,0,null,0,null,0,null,16]
[null,"K072",0,null,0,null,0,null,0,null,0,null,0,null,17]
[null,"K081",0,null,0,null,0,null,0,null,0,null,0,null,18]
[null,"K082",0,null,0,null,0,null,0,null,0,null,0,null,19]
[null,"K083",0,null,0,null,0,null,0,null,0,null,0,null,20]
[null,"K091",0,null,0,null,0,null,0,null,0,null,0,null,21]
[null,"K092",167,null,240,null,960,null,2667,null,6000,null,8560,null,22]
[null,"K093",3,null,3,null,3,null,3,null,3,null,3,null,23]
[null,"K094",0,null,0,null,0,null,0,null,0,null,0,null,24]
[null,"K101",-0.69299999999999995,null,-0.69299999999999995,null,-0.69299999999999995,null,-0.69299999999999995,null,-0.69299999999999995,null,-0.69299999999999995,null,25]
[null,"K102",33,null,33,null,33,null,33,null,33,null,33,null,26]
[null,"K103",2.3E-2,null,2.7E-2,null,4.1000000000000002E-2,null,5.6000000000000001E-2,null,7.2999999999999995E-2,null,8.1000000000000003E-2,null,27]
[null,"K104",0.01,null,0.01,null,0.01,null,0.01,null,0.01,null,0.01,null,28]
[null,"K021Abluft",-67.264425731983408,-67.264425731983408,-88.575506739069453,-88.575506739069453,-155.01682186987338,-155.01682186987338,-175.56121712265497,-175.56121712265497,-37.533526520372661,-37.533526520372661,-131.77823837400251,-131.77823837400251,29]
[null,"K022Abluft",54.713312600496906,54.713312600496906,59.996608850894788,59.996608850894788,78.177405883609552,78.177405883609552,79.120238615184476,79.120238615184476,24.953256730211685,24.953256730211685,58.549656427178043,58.549656427178043,30]
[null,"K011Abluft",5.2817794700806605E-3,5.2817794700806605E-3,2.4721035245258783E-3,2.4721035245258783E-3,3.5292697479730737E-4,3.5292697479730737E-4,2.489870405115429E-4,2.489870405115429E-4,1.9116624308986664E-5,1.9116624308986664E-5,1.2561912817054505E-4,1.2561912817054505E-4,31]
[null,"K012Abluft",1.9809934495703043,1.9809934495703043,1.9265568133441886,1.9265568133441886,2.002878192933347,2.002878192933347,1.8962849861555875,1.8962849861555875,2.1632734514060856,2.1632734514060856,1.860647180864033,1.860647180864033,32]
[null,"K061",{"$f":"1.3/C19","v":32.5},{"$f":"1.3/D19","v":{"$error":"#DIV/0!"}},25.490196078431374,{"$error":"#DIV/0!"},13,{"$error":"#DIV/0!"},10,{"$error":"#DIV/0!"},8.6666666666666679,{"$error":"#DIV/0!"},8.125,{"$error":"#DIV/0!"},33]
[]
[null,null,{"$f":"IFERROR(HLOOKUP($E$1,$C$6:$N$33,O6,FALSE),\"\")","v":""}]
[null,null,""]
["Rückgabe","K011",""]
[null,"K012",{"$f":"IFERROR(HLOOKUP($E$1,$C$6:$N$33,O9,FALSE),\"\")","v":""}]
[null,"K021",""]
[null,"K022",""]
[null,"K031",""]
[null,"K032",""]
[null,"K033",""]
[null,"K034",""]
[null,"K041",""]
[null,"K042",""]
[null,"K043",""]
[null,"K051",""]
[null,"K052",""]
[null,"K071",""]
[null,"K072",""]
[null,"K081",""]
[null,"K082",""]
[null,"K083",""]
[null,"K091",""]
[null,"K092",""]
[null,"K093",{"$f":"IFERROR(HLOOKUP($E$1,$C$6:$N$33,O28,FALSE),\"\")","v":""}]
[null,"K094",""]
[null,"K101",""]
[null,"K102",""]
[null,"K103",""]
[null,"K104",""]
[null,"K021Abluft",{"$f":"IFERROR(HLOOKUP($E$1,$C$6:$N$35,O34,FALSE),\"\")","v":""}]
[null,"K022Abluft",{"$f":"IFERROR(HLOOKUP($E$1,$C$6:$N$37,O35,FALSE),\"\")","v":""}]
[null,"K011Abluft",{"$f":"IFERROR(HLOOKUP($E$1,$C$6:$N$37,O36,FALSE),\"\")","v":""}]
[null,"K012Abluft",{"$f":"IFERROR(HLOOKUP($E$1,$C$6:$N$37,O37,FALSE),\"\")","v":""}]
[null,"K061",{"$f":"IFERROR(HLOOKUP($E$1,$C$6:$N$38,O38,FALSE),\"\")","v":""}]

{"sheet":"DIA-CAP","index":15,"n_rows":72,"n_cols":21,"rows_kept":72,"cut":false,"hidden":true,"merged":[[7,14,7,19],[8,14,8,19],[9,14,9,19],[10,14,10,19],[3,14,3,19]]}
["Übergabedaten:",null,"Gewählter Durchlass",null,{"$f":"CONCATENATE(Dimensioning!$D$12,Dimensioning!$D$25,\"d\")","v":"DAL 358500d"}]
[null,null,"Volumenstrom",null,{"$f":"Dimensioning!$D$32","v":350}]
[null,null,"Temperaturdifferenz",null,{"$f":"Dimensioning!$D$35-Dimensioning!$D$34","v":-1}]
[null,null,"DIA","DIA","DIA","DIA","DIA","DIA","DIA","DIA","DIA","DIA","DIA","DIA","DIA"]
[null,null,100,100,125,125,180,180,250,250,315,315,355,355,100,125,180,250,315,355]
[null,null,{"$f":"CONCATENATE(C4,C5,\"d\")","v":"DIA100d"},{"$f":"CONCATENATE(D4,D5,\"f\")","v":"DIA100f"},{"$f":"CONCATENATE(E4,E5,\"d\")","v":"DIA125d"},{"$f":"CONCATENATE(F4,F5,\"f\")","v":"DIA125f"},{"$f":"CONCATENATE(G4,G5,\"d\")","v":"DIA180d"},{"$f":"CONCATENATE(H4,H5,\"f\")","v":"DIA180f"},{"$f":"CONCATENATE(I4,I5,\"d\")","v":"DIA250d"},{"$f":"CONCATENATE(J4,J5,\"f\")","v":"DIA250f"},{"$f":"CONCATENATE(K4,K5,\"d\")","v":"DIA315d"},{"$f":"CONCATENATE(L4,L5,\"f\")","v":"DIA315f"},{"$f":"CONCATENATE(M4,M5,\"d\")","v":"DIA355d"},{"$f":"CONCATENATE(N4,N5,\"f\")","v":"DIA355f"},null,null,null,null,null,null,1]
[null,null,"Deckenbündig","freihängend","Deckenbündig","freihängend","Deckenbündig","freihängend","Deckenbündig","freihängend","Deckenbündig","freihängend","Deckenbündig","freihängend",null,null,null,null,null,null,2]
["Konstante","K011",6.2090000000000001E-3,5.0000000000000001E-3,2.931E-3,2.5000000000000001E-3,7.7030000000000002E-4,7.5000000000000002E-4,1.771E-4,2.22E-4,1.2750000000000001E-4,9.3800000000000003E-5,1.774E-4,5.5600000000000003E-5,"Verwendung des DRS-Konstantensatzes, ",null,null,null,null,null,3]
[null,"K012",1.944,2,1.97,2,1.9890000000000001,2,2.0350000000000001,2,1.9470000000000001,2,1.837,2,"Erhöhung des Druckverlustes um Faktor 1,1 bei gleichem Volumenstrom",null,null,null,null,null,4]
[null,"K021",-60.68,-73.7,-82.15,-82.44,-122.4,-101.27,-122.5,-131.11000000000001,-129.30000000000001,-122.36,-137.5,-133.80000000000001,"Verwendung des DRS-Konstantensatzes, ",null,null,null,null,null,5]
[null,"K022",49.43,54.83,56.22,56.47,67.27,58.13,60.59,64.03,59.05,56.79,59.15,58.6,"Erhöhung des Schallleistungspegels um 2,5 dB",null,null,null,null,null,6]
[null,"K031",3.7690000000000002E-3,2.4220000000000001E-3,3.2669999999999999E-3,2.0370000000000002E-3,2.4069999999999999E-3,1.5330000000000001E-3,1.8779999999999999E-3,1.183E-3,1.5989999999999999E-3,9.8700000000000003E-4,1.405E-3,8.9999999999999998E-4,null,null,null,null,null,null,7]
[null,"K032",1.3,1.61,1.3,1.61,1.3,1.61,1.3,1.61,1.3,1.61,1.3,1.61,null,null,null,null,null,null,8]
[null,"K033",1,1,1,1,1,1,1,1,1,1,1,1,"Hinweise:","Korrektur Totaldruck in Arbeitsblatt \"Grunddaten\"",null,null,null,null,9]
[null,"K034",0.70699999999999996,null,0.70699999999999996,null,0.70699999999999996,null,0.70699999999999996,null,0.70699999999999996,null,0.70699999999999996,null,null,"Korrektur Schallleistungspegel hier durchgeführt",null,null,null,null,10]
[null,"K041",0.1356,null,6.13E-2,null,3.0040000000000001E-2,null,2.274E-2,null,7.9830000000000005E-3,null,5.7619999999999998E-3,null,null,null,null,null,null,null,11]
[null,"K042",0.48849999999999999,null,0.47949999999999998,null,0.50639999999999996,null,0.4642,null,0.4829,null,0.50919999999999999,null,null,null,null,null,null,null,12]
[null,"K043",0.98180000000000001,null,1.0349999999999999,null,1.0269999999999999,null,0.92330000000000001,null,1.01,null,1.0229999999999999,null,null,null,null,null,null,null,13]
[null,"K051",0.04,null,5.0999999999999997E-2,null,0.1,null,0.13,null,0.15,null,0.16,null,null,null,null,null,null,null,14]
[null,"K052",1,null,0.95899999999999996,null,1,null,1.016,null,1,null,1.016,null,null,null,null,null,null,null,15]
[null,"K071",0,null,0,null,0,null,0,null,0,null,0,null,null,null,null,null,null,null,16]
[null,"K072",0,null,0,null,0,null,0,null,0,null,0,null,null,null,null,null,null,null,17]
[null,"K081",0,null,0,null,0,null,0,null,0,null,0,null,null,null,null,null,null,null,18]
[null,"K082",0,null,0,null,0,null,0,null,0,null,0,null,null,null,null,null,null,null,19]
[null,"K083",0,null,0,null,0,null,0,null,0,null,0,null,null,null,null,null,null,null,20]
[null,"K091",0,null,0,null,0,null,0,null,0,null,0,null,null,null,null,null,null,null,21]
[null,"K092",167,null,240,null,960,null,2667,null,6000,null,8560,null,null,null,null,null,null,null,22]
[null,"K093",3,null,3,null,3,null,3,null,3,null,3,null,null,null,null,null,null,null,23]
[null,"K094",0,null,0,null,0,null,0,null,0,null,0,null,null,null,null,null,null,null,24]
[null,"K101",-0.69299999999999995,null,-0.69299999999999995,null,-0.69299999999999995,null,-0.69299999999999995,null,-0.69299999999999995,null,-0.69299999999999995,null,null,null,null,null,null,null,25]
[null,"K102",33,null,33,null,33,null,33,null,33,null,33,null,null,null,null,null,null,null,26]
[null,"K103",2.3E-2,null,2.7E-2,null,4.1000000000000002E-2,null,5.6000000000000001E-2,null,7.2999999999999995E-2,null,8.1000000000000003E-2,null,null,null,null,null,null,null,27]
[null,"K104",0.01,null,0.01,null,0.01,null,0.01,null,0.01,null,0.01,null,null,null,null,null,null,null,28]
[null,"K021Abluft",null,null,null,null,null,null,null,null,null,null,null,null,null,null,null,null,null,null,29]
[null,"K022Abluft",null,null,null,null,null,null,null,null,null,null,null,null,null,null,null,null,null,null,30]
[null,"K011Abluft",null,null,null,null,null,null,null,null,null,null,null,null,null,null,null,null,null,null,31]
[null,"K012Abluft",null,null,null,null,null,null,null,null,null,null,null,null,null,null,null,null,null,null,32]
[null,"K061",{"$f":"1.3/C19","v":32.5},{"$f":"1.3/D19","v":{"$error":"#DIV/0!"}},25.490196078431374,{"$error":"#DIV/0!"},13,{"$error":"#DIV/0!"},10,{"$error":"#DIV/0!"},8.6666666666666679,{"$error":"#DIV/0!"},8.125,{"$error":"#DIV/0!"},null,null,null,null,null,null,33]
[]
[null,null,{"$f":"IFERROR(HLOOKUP($E$1,$C$6:$N$37,U6,FALSE),\"\")","v":""}]
[null,null,{"$f":"IFERROR(HLOOKUP($E$1,$C$6:$N$37,U7,FALSE),\"\")","v":""}]
["Rückgabe","K011",""]
[null,"K012",""]
[null,"K021",""]
[null,"K022",""]
[null,"K031",""]
[null,"K032",""]
[null,"K033",""]
[null,"K034",""]
[null,"K041",""]
[null,"K042",""]
[null,"K043",""]
[null,"K051",""]
[null,"K052",""]
[null,"K071",""]
[null,"K072",""]
[null,"K081",""]
[null,"K082",""]
[null,"K083",""]
[null,"K091",""]
[null,"K092",""]
[null,"K093",""]
[null,"K094",""]
[null,"K101",""]
[null,"K102",""]
[null,"K103",""]
[null,"K104",""]
[null,"K021Abluft",""]
[null,"K022Abluft",{"$f":"IFERROR(HLOOKUP($E$1,$C$6:$N$37,U35,FALSE),\"\")","v":""}]
[null,"K011Abluft",{"$f":"IFERROR(HLOOKUP($E$1,$C$6:$N$37,U36,FALSE),\"\")","v":""}]
[null,"K012Abluft",""]
[null,"K061",{"$f":"IFERROR(HLOOKUP($E$1,$C$6:$N$37,U38,FALSE),\"\")","v":""}]

{"sheet":"MSA-CAP","index":16,"n_rows":73,"n_cols":13,"rows_kept":73,"cut":false,"hidden":true,"merged":[[20,11,24,11]]}
["Übergabedaten:",null,"Gewählter Durchlass",null,{"$f":"CONCATENATE(Dimensioning!$D$12,Dimensioning!$D$25)","v":"DAL 358500"}]
[null,null,"Volumenstrom",null,{"$f":"Dimensioning!$D$32","v":350},null,null,null,null,"Konstantenerrechnung K031-K034 erfolgt über spezifische Volumenströme mit Auslegungskonstanten SAL35"]
[null,null,"Temperaturdifferenz",null,{"$f":"Dimensioning!$D$35-Dimensioning!$D$34","v":-1},null,null,null,null,"Konstanten für die Auslegung stammen vom SAL35!"]
[null,null,"MSA","MSA","MSA","MSA","MSA-V",null,null,"Für die Berechnungen in dieser Arbeitsmappe wurde K031 erweitert auf K031(neu) = K031(SAL35)*Wurzel(Schlitzanzahl)*1/aktive Länge"]
[null,null,300,400,500,600,null,null,null,"K041 wurde ebenfalls angepasst nach K041(neu)=K041(alt)*Wurzel(Schlitzanzahl)*(1/aktive Länge)"]
[null,null,{"$f":"CONCATENATE(C4,C5)","v":"MSA300"},{"$f":"CONCATENATE(D4,D5)","v":"MSA400"},"MSA500","MSA600","MSA-V",1]
[null,null,null,null,null,null,null,2,null,null,"A1/F6"]
["Konstante","K011",9.5575118337991251E-4,2.1898235307689197E-4,3.4357704076325938E-4,6.2897147110562546E-5,5.9748815137567469E-5,3,null,null,2.5200000000000001E-3,null,"Daten für Druckverlust und Schallleistung beruhen auf Katalogangaben!"]
[null,"K012",2.0139004770944648,2.0392900564723835,1.7181591684097095,1.872375326524196,1.9178513948119098,4,null,null,1.92]
[null,"K021",-102.89108412925144,-124.04972114709894,-116.91527170898351,-140.78516782633633,-120.70057428544176,5,null,null,-75.599999999999994]
[null,"K022",60.560770981134887,65.35058245929325,56.589666454135127,62.432981117219406,53.47757548461886,6,null,null,53.72]
[null,"K031",6.4224324594310302E-3,4.2693790199137722E-3,2.8025249313884302E-3,2.1759360269426103E-3,null,7,null,null,5.0270000000000002E-3]
[null,"K032",1,1,1,1,null,8,null,null,5.8]
[null,"K033",1.0074999967909215,1.0199155259013248,0.99880404948741941,1.0319284706827219,null,9,null,null,0.5]
[null,"K034",1,1,1,1,null,10,null,null,0.70699999999999996]
[null,"K041",4.6186298536629145E-2,2.9238506115895936E-2,2.4056493500857895E-2,1.0704162579691813E-2,null,11,null,null,8.8200000000000001E-2]
[null,"K042",0.47346217779012989,0.4610764903286716,0.47527834470737218,0.46965976974571966,null,12,null,null,0.64300000000000002]
[null,"K043",0.98484900749254711,0.97465926308787598,0.94481334081899992,0.98297716696001025,null,13,null,null,1.2869999999999999]
[null,"K051",4.9660000000000003E-2,4.9660000000000003E-2,4.9660000000000003E-2,4.9660000000000003E-2,null,14,null,null,4.9660000000000003E-2]
[null,"K052",0.5,0.5,0.5,0.5,null,15,null,null,0.5]
[null,"K071",{"$f":"$K$21*SQRT(6)*(1/1.2)","v":1.641770500100425E-2},{"$f":"$K$21*SQRT(8)*(1/2.4)","v":9.4787664018056699E-3},{"$f":"$K$21*SQRT(12)*(1/4.8)","v":5.8045352688651996E-3},{"$f":"$K$21*SQRT(14)*(1/7)","v":4.2991643374032584E-3},null,16,null,null,8.0429999999999998E-3,"Heizfallkonstanten SAL 35 aus CAP"]
[null,"K072",0.5,0.5,0.5,0.5,null,17,null,null,0.5]
[null,"K081",{"$f":"$K$23*SQRT(6)*(1/1.2)","v":4.158008838374444E-2},{"$f":"$K$23*SQRT(8)*(1/2.4)","v":2.4006275221283287E-2},{"$f":"$K$23*SQRT(12)*(1/4.8)","v":1.4700781229240845E-2},{"$f":"$K$23*SQRT(14)*(1/7)","v":1.0888222995512169E-2},null,18,null,null,2.0369999999999999E-2,null,"K081 wurde angepasst nach K081(neu)=K081(alt)*Wurzel(Schlitzanzahl)*(1/aktive Länge)"]
[null,"K082",0.64300000000000002,0.64300000000000002,0.64300000000000002,0.64300000000000002,null,19,null,null,0.64300000000000002]
[null,"K083",1.2869999999999999,1.2869999999999999,1.2869999999999999,1.2869999999999999,null,20,null,null,1.2869999999999999]
[null,"K091",0,0,0,0,null,21,null,null,0]
[null,"K092",47,47,47,47,null,22,null,null,47]
[null,"K093",2.5,2.5,2.5,2.5,null,23,null,null,2.5]
[null,"K094",0,0,0,0,null,24,null,null,0]
[null,"K101",-0.69299999999999995,-0.69299999999999995,-0.69299999999999995,-0.69299999999999995,null,25,null,null,-0.69299999999999995]
[null,"K102",24,24,24,24,null,26,null,null,24]
[null,"K103",7.0000000000000001E-3,7.0000000000000001E-3,7.0000000000000001E-3,7.0000000000000001E-3,null,27,null,null,7.0000000000000001E-3]
[null,"K104",0.01,0.01,0.01,0.01,null,28,null,null,0.01]
[null,"K021Abluft",-103.94026648149726,-121.01046508924843,-151.35181645476121,-140.90268033600105,null,29]
[null,"K022Abluft",64.670100161620326,64.171899188115077,69.869216437746232,63.097564584272774,null,30]
[null,"K011Abluft",3.73051103351259E-3,7.6429078770234946E-4,7.5878647096808003E-5,4.5711902171496407E-5,null,31]
[null,"K012Abluft",1.7828094624395789,1.8282435380835766,2.0144842208269549,1.9830324271280104,null,32]
[null,"K061",{"$f":"1.2/C19","v":24.164317358034634},{"$f":"1.2/D19","v":24.164317358034634},24.164317358034634,24.164317358034634,null,33]
[null,null,null,null,null,null,null,34]
[]
[]
["Rückgabe","K011",{"$f":"IFERROR(HLOOKUP($E$1,$C$6:$F$33,H8,FALSE),\"\")","v":""}]
[null,"K012",""]
[null,"K021","",null,null,null,null,"K051, K052 Kanada freihand reingeschossen, dienen nur der Darstellung der Induktionsverhältnisse, 30.05.2016 TU"]
[null,"K022",""]
[null,"K031",""]
[null,"K032",""]
[null,"K033",""]
[null,"K034",""]
[null,"K041",""]
[null,"K042",""]
[null,"K043",""]
[null,"K051",""]
[null,"K052",""]
[null,"K071",""]
[null,"K072",""]
[null,"K081",""]
[null,"K082",""]
[null,"K083",""]
[null,"K091",""]
[null,"K092",""]
[null,"K093",""]
[null,"K094",""]
[null,"K101",""]
[null,"K102",""]
[null,"K103",""]
[null,"K104",""]
[null,"K021Abluft",{"$f":"IFERROR(HLOOKUP($E$1,$C$6:$F$35,H34,FALSE),\"\")","v":""}]
[null,"K022Abluft",{"$f":"IFERROR(HLOOKUP($E$1,$C$6:$F$35,H35,FALSE),\"\")","v":""}]
[null,"K011Abluft",{"$f":"IFERROR(HLOOKUP($E$1,$C$6:$F$37,H36,FALSE),\"\")","v":""}]
[null,"K012Abluft",{"$f":"IFERROR(HLOOKUP($E$1,$C$6:$F$37,H37,FALSE),\"\")","v":""}]
[null,"K061",{"$f":"IFERROR(HLOOKUP($E$1,$C$6:$F$38,H38,FALSE),\"\")","v":""}]
[null,null,{"$f":"IFERROR(HLOOKUP($E$1,$C$6:$F$39,H39,FALSE),\"\")","v":""}]